program: Orca
programVersion: 5.0.2
elementType: O O O C C C C C C C C C C C C C C C C C C C C C C H H H H H H H H H H H H H H H H H H H H H H H H H H
charge: 0
multiplicity: 1
keywords: wb97x-d3
keywords: def2-TZVPP
keywords: def2/J RIJCOSX
keywords: DEFGRID2
keywords: scfconv7
keywords: smallprint printgap noloewdin
keywords: NOSOSCF
formula: C22H26O3
InChI: InChI=1/C22H26O3/c1-15(2)10-19-20(22(19,3)4)21(23)25-14-17-12-18(24-13-17)11-16-8-6-5-7-9-16/h5-10,12-13,19-20H,11,14H2,1-4H3
51 atoms
O  1.758468 -1.918136 -0.322962
O  2.062821 -0.522251 1.399676
O  -2.587365 -1.167597 -0.775485
C  4.782937 0.102057 -0.022101
C  3.775234 1.136994 -0.385931
C  3.427951 -0.331098 -0.554164
C  5.94395 -0.141683 -0.957628
C  5.142409 -0.091617 1.430709
C  3.925283 2.012668 -1.575834
C  2.370019 -0.907962 0.29978
C  2.928864 2.418283 -2.364397
C  3.178398 3.324702 -3.531725
C  1.499007 2.018652 -2.162237
C  0.629489 -2.512518 0.324723
C  -0.619063 -1.743957 0.073796
C  -1.028298 -0.494927 0.643783
C  -1.611722 -2.091413 -0.778372
C  -2.226547 -0.19688 0.090647
C  -3.178287 0.926151 0.293016
C  -4.437301 0.492041 1.005203
C  -4.417352 0.253072 2.375565
C  -5.622644 0.297024 0.309063
C  -5.560565 -0.162933 3.037846
C  -6.769712 -0.122909 0.968156
C  -6.74198 -0.352756 2.334469
H  3.282808 1.59646 0.467954
H  3.432557 -0.704413 -1.5716
H  5.667497 -0.025178 -2.005507
H  6.334136 -1.15226 -0.827957
H  6.758762 0.555005 -0.749974
H  5.463274 -1.117615 1.620696
H  4.318747 0.131626 2.103426
H  5.974553 0.565638 1.690632
H  4.929118 2.367178 -1.793238
H  4.233718 3.570636 -3.642844
H  2.83933 2.866135 -4.464056
H  2.624466 4.260923 -3.426979
H  1.121885 1.473221 -3.030979
H  1.343481 1.394083 -1.28595
H  0.865873 2.902834 -2.055003
H  0.818102 -2.621354 1.393738
H  0.55121 -3.509614 -0.107885
H  -0.492742 0.091447 1.371376
H  -1.748158 -2.941247 -1.428116
H  -3.43308 1.380759 -0.668483
H  -2.666236 1.696617 0.87245
H  -3.494966 0.389703 2.927807
H  -5.651228 0.473647 -0.759384
H  -5.529666 -0.340113 4.104943
H  -7.686054 -0.270646 0.411859
H  -7.635911 -0.677651 2.850329
totalener: -1079.73223589 hartree
nucrepener: 2087.38127116 hartree
electener: -3167.11350705 hartree
oneelecener: -5613.13732553 hartree
twoeener: 2446.02381848 hartree
kineticenergy: 1074.91844734 hartree
xcener: -106.467439094983 hartree
chargesum: -0.0000000
charge: -0.258530 -0.410149 -0.251708 0.136520 -0.025927 -0.116414 -0.274699 -0.258278 -0.235205 0.357686 -0.010479 -0.211878 -0.205618 0.059547 -0.053336 -0.306966 -0.036376 0.247029 -0.133218 0.082110 -0.164098 -0.150340 -0.126394 -0.124506 -0.132454 0.103346 0.086710 0.085125 0.091067 0.089493 0.084099 0.101177 0.081757 0.092634 0.078638 0.084709 0.086277 0.086978 0.073925 0.087019 0.112209 0.094830 0.152710 0.134616 0.098665 0.109990 0.110934 0.105454 0.124332 0.122471 0.124515
qa: -0.2585 -0.4101 -0.2517 0.1365 -0.0259 -0.1164 -0.2747 -0.2583 -0.2352 0.3577 -0.0105 -0.2119 -0.2056 0.0595 -0.0533 -0.3070 -0.0364 0.2470 -0.1332 0.0821 -0.1641 -0.1503 -0.1264 -0.1245 -0.1325 0.1033 0.0867 0.0851 0.0911 0.0895 0.0841 0.1012 0.0818 0.0926 0.0786 0.0847 0.0863 0.0870 0.0739 0.0870 0.1122 0.0948 0.1527 0.1346 0.0987 0.1100 0.1109 0.1055 0.1243 0.1225 0.1245
va: 2.1246 2.0802 2.3150 3.7182 3.8339 3.8321 3.9133 3.9006 3.8904 4.1730 3.7545 3.9409 3.9472 3.8932 3.7249 4.0076 4.0027 3.5873 3.8777 3.6246 4.0007 4.0092 3.9684 3.9600 3.9602 1.0274 1.0329 1.0048 1.0065 1.0014 1.0023 1.0225 1.0019 1.0100 1.0097 0.9990 0.9987 1.0023 1.0148 1.0022 1.0080 0.9974 1.0230 1.0072 1.0105 1.0078 1.0116 1.0126 1.0004 1.0008 0.9997
dispcorr: -0.023298962 hartree
energy: -1079.755534852177
dipole: 21.82110 -21.74715 0.07394 11.48482 -11.50120 -0.01638 -8.00999 7.45119 -0.55880
magnitude: 0.56391 au
magnitude: 1.43335 debye
