program: Orca
programVersion: 5.0.2
elementType: O O O C C C C C C C C C C C C C C C C C C C C C C H H H H H H H H H H H H H H H H H H H H H H H H H H
charge: 0
multiplicity: 1
keywords: wb97x-d3
keywords: def2-TZVPP
keywords: def2/J RIJCOSX
keywords: DEFGRID2
keywords: scfconv7
keywords: smallprint printgap noloewdin
keywords: NOSOSCF
formula: C22H26O3
InChI: InChI=1/C22H26O3/c1-15(2)10-19-20(22(19,3)4)21(23)25-14-17-12-18(24-13-17)11-16-8-6-5-7-9-16/h5-10,12-13,19-20H,11,14H2,1-4H3
51 atoms
O  2.082574 -2.074409 0.49414
O  2.169385 -2.091095 -1.73822
O  -2.073643 -2.077421 -0.716721
C  3.823153 0.446429 0.425538
C  2.380593 0.823695 0.436342
C  2.894634 -0.148609 -0.615177
C  4.82321 1.440054 -0.121252
C  4.383854 -0.383151 1.555459
C  1.888646 2.16406 0.027761
C  2.373395 -1.527827 -0.694448
C  0.768324 2.377947 -0.664609
C  0.334702 3.763333 -1.033525
C  -0.127398 1.274409 -1.143156
C  1.199752 -3.200638 0.474449
C  -0.198181 -2.735799 0.266541
C  -1.073937 -2.176886 1.250616
C  -0.866368 -2.6394 -0.907372
C  -2.195722 -1.795447 0.597454
C  -3.442158 -1.120558 1.045334
C  -3.498731 0.330343 0.629016
C  -2.921223 1.313774 1.424749
C  -4.103344 0.705612 -0.564987
C  -2.959481 2.646238 1.045336
C  -4.140421 2.037605 -0.950915
C  -3.571664 3.012557 -0.144918
H  1.800648 0.346644 1.222656
H  3.011976 0.268756 -1.6085
H  5.131454 2.143171 0.655273
H  4.421753 2.019437 -0.952453
H  5.718375 0.926711 -0.47591
H  5.209028 -1.008239 1.209235
H  3.644257 -1.030949 2.017161
H  4.77657 0.27676 2.331572
H  2.480911 3.02072 0.337337
H  0.221502 3.862003 -2.116193
H  -0.641536 3.991429 -0.598857
H  1.042808 4.520752 -0.698712
H  0.038305 1.076917 -2.20573
H  0.023285 0.338804 -0.608653
H  -1.177304 1.549998 -1.033892
H  1.315224 -3.668289 1.451391
H  1.502144 -3.92081 -0.285832
H  -0.884259 -2.07448 2.307338
H  -0.602874 -2.907807 -1.91707
H  -3.491634 -1.196509 2.132904
H  -4.315627 -1.652797 0.658753
H  -2.434942 1.034554 2.352044
H  -4.552168 -0.05018 -1.198025
H  -2.509544 3.399094 1.679196
H  -4.618067 2.314642 -1.881586
H  -3.607092 4.052743 -0.441234
totalener: -1079.72794064 hartree
nucrepener: 2241.37734032 hartree
electener: -3321.10528095 hartree
oneelecener: -5921.10471600 hartree
twoeener: 2599.99943505 hartree
kineticenergy: 1074.91751398 hartree
xcener: -106.469630352157 hartree
chargesum: -0.0000000
charge: -0.271866 -0.373394 -0.249636 0.154638 -0.012920 -0.088394 -0.278803 -0.256297 -0.266534 0.308094 0.011533 -0.213438 -0.151590 0.041331 -0.079117 -0.264219 0.011724 0.208429 -0.140582 0.086890 -0.157902 -0.149696 -0.134151 -0.100388 -0.161262 0.090801 0.084015 0.087959 0.087046 0.092769 0.089984 0.088777 0.080937 0.091341 0.089579 0.077176 0.078464 0.106279 0.032958 0.060741 0.092536 0.116572 0.122104 0.151468 0.103130 0.106891 0.104391 0.110126 0.128124 0.124680 0.128707
qa: -0.2719 -0.3734 -0.2496 0.1546 -0.0129 -0.0884 -0.2788 -0.2563 -0.2665 0.3081 0.0115 -0.2134 -0.1516 0.0413 -0.0791 -0.2642 0.0117 0.2084 -0.1406 0.0869 -0.1579 -0.1497 -0.1342 -0.1004 -0.1613 0.0908 0.0840 0.0880 0.0870 0.0928 0.0900 0.0888 0.0809 0.0913 0.0896 0.0772 0.0785 0.1063 0.0330 0.0607 0.0925 0.1166 0.1221 0.1515 0.1031 0.1069 0.1044 0.1101 0.1281 0.1247 0.1287
va: 2.0813 2.1269 2.3059 3.7057 3.8057 3.8267 3.9168 3.8945 3.8826 4.2370 3.7537 3.9377 3.9518 3.9007 3.6977 4.0092 3.9470 3.6263 3.8763 3.5939 3.9593 3.9972 3.9033 3.9191 3.9095 1.0262 1.0305 1.0012 1.0048 1.0055 1.0030 1.0199 1.0024 1.0109 0.9991 1.0037 1.0109 1.0071 1.0236 1.0099 0.9967 1.0111 1.0174 1.0123 1.0104 1.0094 1.0128 1.0149 1.0001 1.0003 1.0005
dispcorr: -0.029340339 hartree
energy: -1079.757280976967
dipole: 11.13766 -11.52998 -0.39232 16.64850 -16.24476 0.40374 2.22657 -1.40013 0.82645
magnitude: 0.99997 au
magnitude: 2.54172 debye
