program: Orca
programVersion: 5.0.2
elementType: O O O C C C C C C C C C C C C C C C C C C C C C C H H H H H H H H H H H H H H H H H H H H H H H H H H
charge: 0
multiplicity: 1
keywords: wb97x-d3
keywords: def2-TZVPP
keywords: def2/J RIJCOSX
keywords: DEFGRID2
keywords: scfconv7
keywords: smallprint printgap noloewdin
keywords: NOSOSCF
formula: C22H26O3
InChI: InChI=1/C22H26O3/c1-15(2)10-19-20(22(19,3)4)21(23)25-14-17-12-18(24-13-17)11-16-8-6-5-7-9-16/h5-10,12-13,19-20H,11,14H2,1-4H3
51 atoms
O  1.312466 -1.626998 -1.031443
O  2.59866 -1.805106 0.790513
O  -1.434473 -1.454301 2.387636
C  4.527783 0.053618 -0.849198
C  3.752763 0.857757 0.138677
C  3.015036 -0.071555 -0.804142
C  5.074577 0.745777 -2.075467
C  5.408901 -1.067443 -0.355506
C  3.60511 2.33044 0.015246
C  2.323966 -1.251499 -0.243941
C  2.481132 3.020518 0.213688
C  2.450824 4.513061 0.076543
C  1.173517 2.390955 0.586515
C  0.440448 -2.641068 -0.521356
C  -0.517561 -2.08032 0.468992
C  -1.733651 -1.374714 0.197705
C  -0.3941 -2.086729 1.816767
C  -2.24729 -1.020974 1.398846
C  -3.475139 -0.281979 1.804857
C  -4.327575 0.061671 0.614337
C  -4.21414 1.297353 -0.011202
C  -5.224363 -0.868792 0.099171
C  -4.984346 1.601871 -1.124611
C  -5.99471 -0.569722 -1.013653
C  -5.877057 0.668511 -1.628621
H  3.80627 0.481044 1.157674
H  2.492549 0.401484 -1.627762
H  4.421374 1.54266 -2.431334
H  5.205095 0.033541 -2.8918
H  6.050865 1.187678 -1.865065
H  5.036614 -1.525813 0.5569
H  6.410575 -0.683298 -0.152923
H  5.504773 -1.850851 -1.10992
H  4.5080 2.882886 -0.231459
H  3.420662 4.919431 -0.207775
H  1.722125 4.822561 -0.676983
H  2.14889 4.987398 1.013557
H  0.422208 2.565395 -0.188104
H  1.240595 1.318318 0.749929
H  0.782735 2.840015 1.502875
H  1.015446 -3.461921 -0.091124
H  -0.086691 -3.019011 -1.396639
H  -2.166006 -1.164417 -0.767198
H  0.363784 -2.478786 2.474609
H  -3.198604 0.63033 2.342702
H  -4.050235 -0.885734 2.51391
H  -3.516073 2.029826 0.37659
H  -5.317328 -1.838206 0.574245
H  -4.888595 2.570518 -1.597483
H  -6.689976 -1.303572 -1.399809
H  -6.480419 0.905064 -2.495041
totalener: -1079.73278801 hartree
nucrepener: 2114.79969399 hartree
electener: -3194.53248200 hartree
oneelecener: -5667.93408000 hartree
twoeener: 2473.40159800 hartree
kineticenergy: 1074.91000844 hartree
xcener: -106.467056625106 hartree
chargesum: -0.0000000
charge: -0.261388 -0.403532 -0.255839 0.126332 -0.016419 -0.114156 -0.271490 -0.260356 -0.242148 0.339124 -0.005361 -0.212856 -0.217345 0.063878 -0.090498 -0.248944 0.006331 0.166082 -0.050280 0.019859 -0.149394 -0.159942 -0.123786 -0.121728 -0.127477 0.104499 0.088946 0.085169 0.091361 0.088940 0.101693 0.081494 0.084373 0.092773 0.078530 0.083320 0.087047 0.085372 0.086754 0.087660 0.111273 0.102943 0.137259 0.150577 0.090591 0.095917 0.107547 0.111932 0.124371 0.125164 0.125829
qa: -0.2614 -0.4035 -0.2558 0.1263 -0.0164 -0.1142 -0.2715 -0.2604 -0.2421 0.3391 -0.0054 -0.2129 -0.2173 0.0639 -0.0905 -0.2489 0.0063 0.1661 -0.0503 0.0199 -0.1494 -0.1599 -0.1238 -0.1217 -0.1275 0.1045 0.0889 0.0852 0.0914 0.0889 0.1017 0.0815 0.0844 0.0928 0.0785 0.0833 0.0870 0.0854 0.0868 0.0877 0.1113 0.1029 0.1373 0.1506 0.0906 0.0959 0.1075 0.1119 0.1244 0.1252 0.1258
va: 2.1214 2.0906 2.3023 3.7273 3.8176 3.8303 3.9101 3.9024 3.8964 4.2040 3.7523 3.9410 3.9469 3.8626 3.7022 4.0020 3.9687 3.6913 3.8553 3.6674 3.9779 3.9833 3.9624 3.9561 3.9530 1.0276 1.0305 1.0054 1.0062 1.0019 1.0218 1.0023 1.0019 1.0103 1.0101 0.9991 0.9988 1.0017 1.0102 1.0019 1.0118 0.9931 1.0091 1.0139 1.0077 1.0069 1.0122 1.0105 1.0004 1.0002 0.9996
dispcorr: -0.023759290 hartree
energy: -1079.756547296288
dipole: 16.99715 -17.44998 -0.45283 15.67229 -15.22853 0.44376 -6.48821 5.93191 -0.55630
magnitude: 0.84347 au
magnitude: 2.14394 debye
