program: Orca
programVersion: 5.0.2
elementType: O O O C C C C C C C C C C C C C C C C C C C C C C H H H H H H H H H H H H H H H H H H H H H H H H H H
charge: 0
multiplicity: 1
keywords: wb97x-d3
keywords: def2-TZVPP
keywords: def2/J RIJCOSX
keywords: DEFGRID2
keywords: scfconv7
keywords: smallprint printgap noloewdin
keywords: NOSOSCF
formula: C22H26O3
InChI: InChI=1/C22H26O3/c1-15(2)10-19-20(22(19,3)4)21(23)25-14-17-12-18(24-13-17)11-16-8-6-5-7-9-16/h5-10,12-13,19-20H,11,14H2,1-4H3
51 atoms
O  1.16508 -1.393026 -1.343687
O  2.182388 -1.928418 0.574588
O  -1.896852 -2.835839 1.352139
C  1.288465 1.460652 -0.032702
C  2.139329 1.338615 -1.253972
C  2.282205 0.314835 -0.149083
C  1.627957 2.501366 1.00793
C  -0.196724 1.219681 -0.159917
C  3.256022 2.275302 -1.542882
C  1.882373 -1.105069 -0.249772
C  4.368494 1.955889 -2.205485
C  5.437657 2.970177 -2.477908
C  4.637258 0.581705 -2.738435
C  0.534778 -2.680176 -1.371267
C  -0.648958 -2.682374 -0.472216
C  -1.905287 -2.043173 -0.709851
C  -0.709662 -3.14174 0.799528
C  -2.617549 -2.156475 0.434345
C  -3.908164 -1.560098 0.874804
C  -3.703566 -0.130421 1.32206
C  -3.080534 0.149054 2.534837
C  -4.074061 0.92788 0.501563
C  -2.83175 1.458477 2.91485
C  -3.826405 2.239951 0.879128
C  -3.202132 2.508942 2.086724
H  1.607046 0.980375 -2.130716
H  3.156706 0.426062 0.481993
H  2.702322 2.646608 1.121445
H  1.229733 2.206347 1.980044
H  1.185989 3.466327 0.750633
H  -0.704173 2.162426 -0.372782
H  -0.623455 0.825296 0.763791
H  -0.444843 0.527694 -0.960281
H  3.133001 3.301333 -1.207551
H  5.184376 3.950383 -2.075851
H  6.390113 2.662223 -2.039293
H  5.611397 3.081764 -3.551063
H  5.601642 0.207916 -2.385771
H  3.874204 -0.140703 -2.456874
H  4.69257 0.598035 -3.830244
H  1.244088 -3.463289 -1.101626
H  0.244167 -2.825992 -2.410901
H  -2.21772 -1.535037 -1.608438
H  0.000686 -3.665506 1.41734
H  -4.33946 -2.15701 1.681766
H  -4.619717 -1.592096 0.048044
H  -2.779894 -0.664698 3.183813
H  -4.559334 0.725655 -0.446131
H  -2.345927 1.659734 3.860767
H  -4.121432 3.052077 0.227492
H  -3.007285 3.53105 2.383392
totalener: -1079.72676226 hartree
nucrepener: 2197.20703798 hartree
electener: -3276.93380023 hartree
oneelecener: -5832.80828597 hartree
twoeener: 2555.87448574 hartree
kineticenergy: 1074.91934023 hartree
xcener: -106.468391938372 hartree
chargesum: 0.0000000
charge: -0.271257 -0.373481 -0.253039 0.192849 -0.001094 -0.121890 -0.289820 -0.282182 -0.256765 0.350361 -0.001312 -0.212487 -0.226153 0.037375 -0.039107 -0.353828 0.008894 0.264174 -0.124664 0.046752 -0.152220 -0.135255 -0.136986 -0.140708 -0.121055 0.099785 0.087064 0.084529 0.093252 0.087594 0.086119 0.093497 0.081712 0.092239 0.078198 0.085740 0.085099 0.084123 0.077644 0.090033 0.111329 0.100930 0.127914 0.148286 0.109198 0.096272 0.115671 0.102635 0.125526 0.123957 0.124553
qa: -0.2713 -0.3735 -0.2530 0.1928 -0.0011 -0.1219 -0.2898 -0.2822 -0.2568 0.3504 -0.0013 -0.2125 -0.2262 0.0374 -0.0391 -0.3538 0.0089 0.2642 -0.1247 0.0468 -0.1522 -0.1353 -0.1370 -0.1407 -0.1211 0.0998 0.0871 0.0845 0.0933 0.0876 0.0861 0.0935 0.0817 0.0922 0.0782 0.0857 0.0851 0.0841 0.0776 0.0900 0.1113 0.1009 0.1279 0.1483 0.1092 0.0963 0.1157 0.1026 0.1255 0.1240 0.1246
va: 2.0821 2.1274 2.3074 3.7014 3.7954 3.8326 3.9146 3.9090 3.9060 4.2039 3.7333 3.9413 3.9421 3.9058 3.6691 4.0158 3.9836 3.5594 3.8668 3.6675 3.9572 3.9506 3.9474 3.9482 3.9234 1.0216 1.0307 1.0059 1.0061 1.0007 1.0042 0.9984 1.0167 1.0096 1.0099 0.9992 0.9980 1.0023 1.0228 1.0002 1.0099 0.9941 1.0177 1.0129 1.0151 1.0118 1.0190 1.0115 1.0009 1.0010 1.0000
dispcorr: -0.027605103 hartree
energy: -1079.754367358758
dipole: 15.09283 -15.55697 -0.46414 18.74814 -18.17346 0.57468 -8.16723 7.56676 -0.60047
magnitude: 0.95197 au
magnitude: 2.41971 debye
