program: Orca
programVersion: 5.0.2
elementType: O O O C C C C C C C C C C C C C C C C C C C C C C H H H H H H H H H H H H H H H H H H H H H H H H H H
charge: 0
multiplicity: 1
keywords: wb97x-d3
keywords: def2-TZVPP
keywords: def2/J RIJCOSX
keywords: DEFGRID2
keywords: scfconv7
keywords: smallprint printgap noloewdin
keywords: NOSOSCF
formula: C22H26O3
InChI: InChI=1/C22H26O3/c1-15(2)10-19-20(22(19,3)4)21(23)25-14-17-12-18(24-13-17)11-16-8-6-5-7-9-16/h5-10,12-13,19-20H,11,14H2,1-4H3
51 atoms
O  1.163241 -0.000657 0.936729
O  1.93959 -1.4380 -0.589341
O  -2.415264 -1.569132 -1.03155
C  3.017667 1.199743 -1.912703
C  4.120298 0.462476 -1.214391
C  2.840297 0.773189 -0.466651
C  3.158695 2.684262 -2.153733
C  2.275199 0.497482 -3.023173
C  5.382871 1.105244 -0.804967
C  1.954788 -0.346097 -0.078188
C  6.618149 0.645674 -1.018472
C  7.815449 1.407815 -0.533236
C  6.942796 -0.626875 -1.740758
C  0.250537 -0.993671 1.418054
C  -0.98857 -1.085701 0.594932
C  -2.271498 -0.539524 0.917177
C  -1.147346 -1.701401 -0.602143
C  -3.098017 -0.865477 -0.10403
C  -4.533814 -0.582817 -0.381947
C  -5.286527 -0.233769 0.873577
C  -5.633751 -1.232556 1.779164
C  -5.634823 1.079101 1.162846
C  -6.322662 -0.927413 2.94084
C  -6.323672 1.390284 2.327783
C  -6.671311 0.387727 3.21838
H  4.196598 -0.579748 -1.50374
H  2.880545 1.581393 0.255588
H  2.180598 3.136837 -2.324444
H  3.771207 2.869021 -3.037981
H  3.620858 3.210871 -1.319932
H  1.261122 0.890391 -3.121923
H  2.204808 -0.576739 -2.873061
H  2.788574 0.669519 -3.971158
H  5.288089 2.04486 -0.268456
H  8.468348 1.686263 -1.364544
H  7.537446 2.320026 -0.006752
H  8.419238 0.800242 0.145718
H  7.521385 -1.297684 -1.100753
H  6.06653 -1.171714 -2.083789
H  7.564378 -0.421792 -2.616033
H  0.001242 -0.671586 2.428168
H  0.752333 -1.959689 1.487135
H  -2.541137 0.012615 1.80327
H  -0.470509 -2.248775 -1.235894
H  -4.988224 -1.457388 -0.856654
H  -4.622728 0.232197 -1.107636
H  -5.359265 -2.259752 1.569984
H  -5.368127 1.868021 0.469699
H  -6.58993 -1.716853 3.63106
H  -6.59041 2.418073 2.536451
H  -7.212549 0.627136 4.124183
totalener: -1079.73340686 hartree
nucrepener: 2028.35327756 hartree
electener: -3108.08668442 hartree
oneelecener: -5495.00968052 hartree
twoeener: 2386.92299610 hartree
kineticenergy: 1074.90313200 hartree
xcener: -106.466756516186 hartree
chargesum: 0.0000000
charge: -0.261384 -0.415222 -0.253625 0.091474 0.045215 -0.102278 -0.243518 -0.263294 -0.187290 0.363836 -0.051853 -0.202889 -0.236562 0.068856 -0.084310 -0.248873 -0.003611 0.163187 -0.059832 0.010545 -0.161348 -0.142046 -0.115813 -0.122850 -0.131222 0.088974 0.070816 0.091108 0.092020 0.070115 0.086296 0.096943 0.085980 0.071418 0.083367 0.076370 0.083679 0.085666 0.084207 0.084647 0.097217 0.116313 0.138016 0.155368 0.102869 0.085175 0.113636 0.108902 0.125386 0.124291 0.125927
qa: -0.2614 -0.4152 -0.2536 0.0915 0.0452 -0.1023 -0.2435 -0.2633 -0.1873 0.3638 -0.0519 -0.2029 -0.2366 0.0689 -0.0843 -0.2489 -0.0036 0.1632 -0.0598 0.0105 -0.1613 -0.1420 -0.1158 -0.1229 -0.1312 0.0890 0.0708 0.0911 0.0920 0.0701 0.0863 0.0969 0.0860 0.0714 0.0834 0.0764 0.0837 0.0857 0.0842 0.0846 0.0972 0.1163 0.1380 0.1554 0.1029 0.0852 0.1136 0.1089 0.1254 0.1243 0.1259
va: 2.1431 2.0813 2.3098 3.7362 3.7732 3.9030 3.9131 3.9146 3.8989 4.2134 3.8257 3.9346 3.9457 3.8503 3.7045 4.0223 3.9624 3.6989 3.8401 3.6879 3.9883 3.9651 3.9492 3.9606 3.9556 1.0364 1.0382 1.0047 1.0039 1.0111 1.0026 1.0222 1.0016 1.0212 0.9982 1.0123 0.9984 0.9992 1.0156 0.9992 0.9976 1.0072 1.0082 1.0154 1.0082 1.0055 1.0095 1.0114 0.9999 1.0006 0.9997
dispcorr: -0.021828007 hartree
energy: -1079.755234866887
dipole: 28.91903 -28.94848 -0.02946 9.92290 -9.35846 0.56443 -9.20853 9.45763 0.24910
magnitude: 0.61766 au
magnitude: 1.56997 debye
