program: Orca
programVersion: 5.0.2
elementType: O O O C C C C C C C C C C C C C C C C C C C C C C H H H H H H H H H H H H H H H H H H H H H H H H H H
charge: 0
multiplicity: 1
keywords: wb97x-d3
keywords: def2-TZVPP
keywords: def2/J RIJCOSX
keywords: DEFGRID2
keywords: scfconv7
keywords: smallprint printgap noloewdin
keywords: NOSOSCF
formula: C22H26O3
InChI: InChI=1/C22H26O3/c1-15(2)10-19-20(22(19,3)4)21(23)25-14-17-12-18(24-13-17)11-16-8-6-5-7-9-16/h5-10,12-13,19-20H,11,14H2,1-4H3
51 atoms
O  1.163923 -0.546616 0.843738
O  1.87565 -1.569217 -1.014512
O  -2.497469 -1.824942 -1.230965
C  2.831485 1.307073 -1.77859
C  3.990646 0.508433 -1.264468
C  2.71599 0.595089 -0.444571
C  2.874027 2.81598 -1.718612
C  2.092448 0.795396 -2.992084
C  5.229004 1.124214 -0.757604
C  1.892938 -0.620775 -0.270958
C  6.475684 0.673086 -0.917686
C  7.640133 1.422437 -0.340551
C  6.84824 -0.577063 -1.655815
C  0.29868 -1.651562 1.127548
C  -0.97799 -1.581313 0.365289
C  -2.198339 -0.958833 0.781042
C  -1.229017 -2.084815 -0.866755
C  -3.085212 -1.141229 -0.224824
C  -4.509002 -0.7458 -0.411343
C  -5.086323 -0.159232 0.847589
C  -5.503087 -0.991995 1.881788
C  -5.188248 1.215998 1.015732
C  -6.014711 -0.462206 3.055296
C  -5.700739 1.751462 2.189245
C  -6.115557 0.913198 3.212002
H  4.109786 -0.448233 -1.760237
H  2.745028 1.24321 0.424271
H  3.43648 3.216466 -2.564049
H  3.333079 3.197375 -0.807699
H  1.863073 3.224277 -1.767365
H  1.043951 1.099215 -2.966617
H  2.123423 -0.287243 -3.082462
H  2.53742 1.21997 -3.894149
H  5.105257 2.041456 -0.189776
H  8.346139 1.713975 -1.122467
H  7.329658 2.3262 0.182372
H  8.197509 0.801431 0.365352
H  7.388143 -1.263334 -0.998635
H  5.997455 -1.116738 -2.064415
H  7.522423 -0.348541 -2.485058
H  0.103486 -1.580892 2.196868
H  0.816393 -2.593298 0.941246
H  -2.387363 -0.449993 1.712616
H  -0.61627 -2.623013 -1.570557
H  -5.093612 -1.618738 -0.718491
H  -4.592038 -0.025531 -1.231444
H  -5.42231 -2.066359 1.765916
H  -4.864194 1.876723 0.220615
H  -6.33729 -1.123514 3.848831
H  -5.777241 2.824958 2.302265
H  -6.517995 1.32819 4.126693
totalener: -1079.73397806 hartree
nucrepener: 2039.24638922 hartree
electener: -3118.98036728 hartree
oneelecener: -5516.82729316 hartree
twoeener: 2397.84692588 hartree
kineticenergy: 1074.90385965 hartree
xcener: -106.467184458689 hartree
chargesum: 0.0000000
charge: -0.263451 -0.412017 -0.254835 0.085362 0.037798 -0.085256 -0.254238 -0.257334 -0.183152 0.365080 -0.053592 -0.202047 -0.237667 0.063949 -0.092638 -0.240449 0.002588 0.160425 -0.053824 0.014867 -0.164525 -0.142232 -0.119568 -0.125538 -0.127721 0.088680 0.070854 0.092971 0.071635 0.090566 0.086004 0.098024 0.084268 0.070093 0.082903 0.075895 0.083795 0.085327 0.084523 0.084939 0.099901 0.114419 0.138216 0.152467 0.099001 0.087740 0.113520 0.108718 0.125738 0.124550 0.125266
qa: -0.2635 -0.4120 -0.2548 0.0854 0.0378 -0.0853 -0.2542 -0.2573 -0.1832 0.3651 -0.0536 -0.2020 -0.2377 0.0639 -0.0926 -0.2404 0.0026 0.1604 -0.0538 0.0149 -0.1645 -0.1422 -0.1196 -0.1255 -0.1277 0.0887 0.0709 0.0930 0.0716 0.0906 0.0860 0.0980 0.0843 0.0701 0.0829 0.0759 0.0838 0.0853 0.0845 0.0849 0.0999 0.1144 0.1382 0.1525 0.0990 0.0877 0.1135 0.1087 0.1257 0.1245 0.1253
va: 2.1387 2.0877 2.3072 3.7390 3.7933 3.8696 3.9175 3.9143 3.9091 4.2161 3.8297 3.9336 3.9444 3.8613 3.6961 4.0141 3.9669 3.7024 3.8548 3.6747 3.9821 3.9758 3.9524 3.9631 3.9538 1.0322 1.0370 1.0030 1.0111 1.0040 1.0024 1.0232 1.0010 1.0221 0.9981 1.0124 0.9983 0.9989 1.0166 0.9990 0.9956 1.0091 1.0080 1.0151 1.0064 1.0079 1.0099 1.0115 1.0000 1.0006 0.9999
dispcorr: -0.021806447 hartree
energy: -1079.755784506485
dipole: 28.03946 -28.08423 -0.04477 11.77712 -11.26575 0.51137 -7.02930 7.42047 0.39116
magnitude: 0.64538 au
magnitude: 1.64042 debye
