program: Orca
programVersion: 5.0.2
elementType: O O O C C C C C C C C C C C C C C C C C C C C C C H H H H H H H H H H H H H H H H H H H H H H H H H H
charge: 0
multiplicity: 1
keywords: wb97x-d3
keywords: def2-TZVPP
keywords: def2/J RIJCOSX
keywords: DEFGRID2
keywords: scfconv7
keywords: smallprint printgap noloewdin
keywords: NOSOSCF
formula: C22H26O3
InChI: InChI=1/C22H26O3/c1-15(2)10-19-20(22(19,3)4)21(23)25-14-17-12-18(24-13-17)11-16-8-6-5-7-9-16/h5-10,12-13,19-20H,11,14H2,1-4H3
51 atoms
O  1.72971 -2.113326 -1.118677
O  2.031723 -1.887638 1.085835
O  -2.055079 -2.716993 1.06128
C  3.637471 0.674851 0.411555
C  2.200815 1.077484 0.482011
C  2.609653 -0.0939 -0.393754
C  4.578236 1.524921 -0.409684
C  4.298211 0.071497 1.62691
C  1.720209 2.354917 -0.102521
C  2.12005 -1.439357 -0.026603
C  0.739599 2.521567 -0.992066
C  0.376415 3.88952 -1.486218
C  -0.075767 1.410265 -1.577443
C  0.97393 -3.307253 -0.900328
C  -0.367766 -2.975363 -0.351757
C  -1.351848 -2.127554 -0.949531
C  -0.856739 -3.294375 0.86779
C  -2.348131 -1.994405 -0.043203
C  -3.565716 -1.14022 -0.007941
C  -3.256715 0.318134 0.260929
C  -2.26625 0.691838 1.165701
C  -3.965998 1.316474 -0.397058
C  -1.992246 2.029179 1.402373
C  -3.697685 2.657488 -0.158292
C  -2.708426 3.018423 0.742928
H  1.703829 0.77618 1.402184
H  2.619021 0.100676 -1.459987
H  4.967108 2.353424 0.185834
H  4.094541 1.95021 -1.288841
H  5.431073 0.934006 -0.748105
H  3.605812 -0.478534 2.257056
H  4.744851 0.86638 2.227646
H  5.100104 -0.61036 1.337843
H  2.225569 3.245011 0.264815
H  -0.67002 4.113569 -1.265222
H  0.993333 4.668276 -1.039072
H  0.486785 3.955432 -2.571735
H  0.094014 0.45102 -1.097288
H  -1.140177 1.637079 -1.485416
H  0.132093 1.300106 -2.645936
H  1.506698 -3.996306 -0.241987
H  0.901351 -3.76768 -1.885504
H  -1.302451 -1.649257 -1.914763
H  -0.459884 -3.881528 1.679414
H  -4.252065 -1.518487 0.754989
H  -4.09481 -1.226017 -0.959331
H  -1.689043 -0.064549 1.682678
H  -4.735737 1.045018 -1.110255
H  -1.207783 2.300313 2.096215
H  -4.260611 3.419362 -0.681975
H  -2.492307 4.062423 0.92827
totalener: -1079.72811366 hartree
nucrepener: 2260.48774551 hartree
electener: -3340.21585916 hartree
oneelecener: -5959.43504008 hartree
twoeener: 2619.21918091 hartree
kineticenergy: 1074.91514004 hartree
xcener: -106.471655763385 hartree
chargesum: 0.0000000
charge: -0.269389 -0.390129 -0.252617 0.136035 -0.011286 -0.118954 -0.264774 -0.259212 -0.252052 0.338672 -0.001933 -0.212480 -0.202539 0.066943 -0.042041 -0.349766 0.011597 0.241531 -0.074752 0.023468 -0.157611 -0.162522 -0.083456 -0.092045 -0.199844 0.093918 0.095158 0.087269 0.084224 0.091811 0.101099 0.079553 0.083100 0.090388 0.083119 0.077947 0.087390 0.056888 0.090638 0.104707 0.101877 0.106043 0.134324 0.137202 0.100288 0.092137 0.119891 0.103408 0.121686 0.124274 0.130815
qa: -0.2694 -0.3901 -0.2526 0.1360 -0.0113 -0.1190 -0.2648 -0.2592 -0.2521 0.3387 -0.0019 -0.2125 -0.2025 0.0669 -0.0420 -0.3498 0.0116 0.2415 -0.0748 0.0235 -0.1576 -0.1625 -0.0835 -0.0920 -0.1998 0.0939 0.0952 0.0873 0.0842 0.0918 0.1011 0.0796 0.0831 0.0904 0.0831 0.0779 0.0874 0.0569 0.0906 0.1047 0.1019 0.1060 0.1343 0.1372 0.1003 0.0921 0.1199 0.1034 0.1217 0.1243 0.1308
va: 2.1142 2.1063 2.3009 3.7450 3.8025 3.8633 3.9030 3.8977 3.8578 4.1944 3.7744 3.9345 3.9123 3.9051 3.6753 3.9910 3.9759 3.5918 3.8359 3.7210 3.9083 3.9895 3.8627 3.9130 3.9318 1.0259 1.0280 1.0035 1.0070 1.0056 1.0254 1.0011 1.0028 1.0115 1.0019 1.0102 1.0008 1.0199 0.9974 1.0044 1.0083 0.9889 1.0151 1.0101 1.0097 1.0073 1.0169 1.0120 1.0041 1.0003 0.9993
dispcorr: -0.030149583 hartree
energy: -1079.758263241229
dipole: 11.47360 -11.74507 -0.27148 18.72637 -18.36968 0.35669 -5.27523 4.58817 -0.68706
magnitude: 0.82035 au
magnitude: 2.08517 debye
