program: Orca
programVersion: 5.0.2
elementType: O O O C C C C C C C C C C C C C C C C C C C C C C H H H H H H H H H H H H H H H H H H H H H H H H H H
charge: 0
multiplicity: 1
keywords: wb97x-d3
keywords: def2-TZVPP
keywords: def2/J RIJCOSX
keywords: DEFGRID2
keywords: scfconv7
keywords: smallprint printgap noloewdin
keywords: NOSOSCF
formula: C22H26O3
InChI: InChI=1/C22H26O3/c1-15(2)10-19-20(22(19,3)4)21(23)25-14-17-12-18(24-13-17)11-16-8-6-5-7-9-16/h5-10,12-13,19-20H,11,14H2,1-4H3
51 atoms
O  0.800028 -0.400868 -0.762096
O  2.066113 -0.216327 -2.593525
O  -2.53593 -2.839009 0.697244
C  3.532172 1.983162 -0.889433
C  4.308116 0.710806 -0.876847
C  2.835376 0.686109 -0.514672
C  3.723849 2.958605 0.247668
C  3.249893 2.657405 -2.209532
C  5.342386 0.422236 0.149885
C  1.8912 -0.002694 -1.420651
C  5.583816 -0.776051 0.683413
C  6.666103 -0.975027 1.700973
C  4.814053 -2.009271 0.321254
C  -0.15174 -1.164817 -1.50823
C  -1.237185 -1.579406 -0.586287
C  -2.289894 -0.771133 -0.051758
C  -1.446018 -2.820543 -0.090864
C  -3.046661 -1.58818 0.717132
C  -4.27113 -1.367161 1.534911
C  -4.859884 -0.007447 1.27633
C  -5.654456 0.209856 0.155057
C  -4.591418 1.06134 2.12236
C  -6.173499 1.466499 -0.112068
C  -5.108314 2.322113 1.858285
C  -5.900589 2.527783 0.739763
H  4.511376 0.304049 -1.864917
H  2.601993 0.579877 0.538593
H  3.907292 2.459868 1.199428
H  2.838966 3.585814 0.36697
H  4.571374 3.618261 0.049873
H  4.066123 3.340195 -2.453311
H  2.332819 3.247463 -2.158074
H  3.149716 1.952311 -3.030694
H  5.964352 1.257146 0.460746
H  6.259249 -1.377769 2.632077
H  7.409043 -1.69532 1.349659
H  7.184492 -0.046061 1.935399
H  4.072884 -1.837194 -0.455509
H  5.489606 -2.792591 -0.031259
H  4.298607 -2.415719 1.195416
H  0.333056 -2.038421 -1.951232
H  -0.54623 -0.564729 -2.331646
H  -2.459151 0.279147 -0.225046
H  -0.920898 -3.753929 -0.217742
H  -4.035815 -1.478796 2.598241
H  -5.00726 -2.143985 1.306322
H  -5.864725 -0.613495 -0.517384
H  -3.969804 0.907743 2.996446
H  -6.79244 1.618116 -0.986719
H  -4.891517 3.143461 2.528656
H  -6.305857 3.509383 0.532692
totalener: -1079.73248647 hartree
nucrepener: 2038.79699197 hartree
electener: -3118.52947845 hartree
oneelecener: -5515.76544036 hartree
twoeener: 2397.23596191 hartree
kineticenergy: 1074.90600986 hartree
xcener: -106.464692152951 hartree
chargesum: -0.0000000
charge: -0.250140 -0.391970 -0.255859 0.128629 -0.024382 -0.094991 -0.272628 -0.259353 -0.236885 0.317856 -0.004592 -0.211082 -0.226675 0.058905 -0.044098 -0.221327 -0.029966 0.160318 -0.057375 0.011998 -0.161074 -0.145425 -0.117669 -0.123075 -0.129400 0.105592 0.086772 0.084854 0.091305 0.088821 0.082355 0.084256 0.102608 0.093029 0.084301 0.086408 0.078649 0.082724 0.089564 0.087695 0.088913 0.100563 0.137889 0.137165 0.089337 0.098526 0.112246 0.109290 0.125670 0.125230 0.126497
qa: -0.2501 -0.3920 -0.2559 0.1286 -0.0244 -0.0950 -0.2726 -0.2594 -0.2369 0.3179 -0.0046 -0.2111 -0.2267 0.0589 -0.0441 -0.2213 -0.0300 0.1603 -0.0574 0.0120 -0.1611 -0.1454 -0.1177 -0.1231 -0.1294 0.1056 0.0868 0.0849 0.0913 0.0888 0.0824 0.0843 0.1026 0.0930 0.0843 0.0864 0.0786 0.0827 0.0896 0.0877 0.0889 0.1006 0.1379 0.1372 0.0893 0.0985 0.1122 0.1093 0.1257 0.1252 0.1265
va: 2.1208 2.1079 2.3015 3.7346 3.8200 3.8422 3.9117 3.9005 3.8993 4.2041 3.7400 3.9411 3.9439 3.8764 3.7520 3.9891 3.9755 3.6980 3.8599 3.6771 3.9864 3.9747 3.9538 3.9606 3.9551 1.0275 1.0305 1.0049 1.0064 1.0016 1.0023 1.0017 1.0212 1.0098 0.9989 0.9988 1.0098 1.0159 1.0016 1.0007 1.0063 0.9947 1.0098 1.0081 1.0073 1.0076 1.0103 1.0115 1.0001 1.0005 0.9996
dispcorr: -0.021975246 hartree
energy: -1079.754461717491
dipole: 26.43943 -26.66788 -0.22845 8.34824 -8.21678 0.13146 3.21626 -2.50005 0.71621
magnitude: 0.76317 au
magnitude: 1.93983 debye
