program: Orca
programVersion: 5.0.2
elementType: O O O C C C C C C C C C C C C C C C C C C C C C C H H H H H H H H H H H H H H H H H H H H H H H H H H
charge: 0
multiplicity: 1
keywords: wb97x-d3
keywords: def2-TZVPP
keywords: def2/J RIJCOSX
keywords: DEFGRID2
keywords: scfconv7
keywords: smallprint printgap noloewdin
keywords: NOSOSCF
formula: C22H26O3
InChI: InChI=1/C22H26O3/c1-15(2)10-19-20(22(19,3)4)21(23)25-14-17-12-18(24-13-17)11-16-8-6-5-7-9-16/h5-10,12-13,19-20H,11,14H2,1-4H3
51 atoms
O  1.593237 -1.900194 -0.328748
O  0.815948 -0.658628 -2.021925
O  -2.385044 -2.646387 1.273565
C  1.774658 1.608982 -0.027483
C  2.640334 1.543996 -1.242148
C  2.368664 0.278206 -0.464445
C  2.343778 2.184181 1.247054
C  0.297487 1.873634 -0.191013
C  4.004686 2.132661 -1.266319
C  1.509998 -0.776308 -1.04429
C  5.055684 1.613932 -1.902515
C  6.392874 2.290587 -1.885565
C  4.996209 0.3367 -2.683215
C  0.699759 -2.967781 -0.663739
C  -0.666437 -2.719525 -0.1288
C  -1.731625 -1.977778 -0.732152
C  -1.133808 -3.096911 1.085123
C  -2.743489 -1.96185 0.165313
C  -4.060336 -1.273737 0.183713
C  -4.022924 -0.037344 1.05234
C  -4.556385 -0.042044 2.334153
C  -3.406264 1.119899 0.587111
C  -4.479829 1.088427 3.136401
C  -3.33072 2.251017 1.382892
C  -3.868176 2.238235 2.662759
H  2.096175 1.598064 -2.182184
H  3.171576 -0.089003 0.164978
H  3.402061 1.955363 1.371541
H  1.813151 1.788488 2.114322
H  2.235578 3.270875 1.262014
H  -0.279452 1.399147 0.605171
H  -0.090104 1.517593 -1.143067
H  0.110432 2.948404 -0.137768
H  4.135526 3.075436 -0.742408
H  7.159592 1.632867 -1.468456
H  6.718352 2.543697 -2.897607
H  6.381983 3.208079 -1.298469
H  5.308672 0.505242 -3.716856
H  5.68516 -0.404716 -2.270176
H  4.001746 -0.103008 -2.706286
H  1.139917 -3.849727 -0.200109
H  0.678897 -3.126537 -1.742706
H  -1.722479 -1.50812 -1.701354
H  -0.697483 -3.671058 1.886955
H  -4.843124 -1.9540 0.529039
H  -4.314059 -1.002305 -0.842558
H  -5.033635 -0.938004 2.712496
H  -2.973065 1.132504 -0.406371
H  -4.898867 1.06921 4.133929
H  -2.8499 3.143425 1.003438
H  -3.809984 3.120681 3.286242
totalener: -1079.73143814 hartree
nucrepener: 2146.32601133 hartree
electener: -3226.05744946 hartree
oneelecener: -5731.10163521 hartree
twoeener: 2505.04418574 hartree
kineticenergy: 1074.91598611 hartree
xcener: -106.467251191204 hartree
chargesum: -0.0000000
charge: -0.256955 -0.399693 -0.249355 0.151844 -0.017793 -0.120249 -0.279144 -0.291587 -0.240670 0.360774 -0.006331 -0.211221 -0.225345 0.044504 -0.055590 -0.282895 -0.032212 0.237423 -0.136839 0.106326 -0.153777 -0.202949 -0.119778 -0.125454 -0.133201 0.106229 0.085366 0.085308 0.094804 0.088599 0.105055 0.093853 0.084559 0.092315 0.084040 0.086591 0.078299 0.089332 0.085731 0.082698 0.098598 0.112711 0.143045 0.134578 0.098270 0.109542 0.105887 0.119892 0.122972 0.127682 0.124209
qa: -0.2570 -0.3997 -0.2494 0.1518 -0.0178 -0.1202 -0.2791 -0.2916 -0.2407 0.3608 -0.0063 -0.2112 -0.2253 0.0445 -0.0556 -0.2829 -0.0322 0.2374 -0.1368 0.1063 -0.1538 -0.2029 -0.1198 -0.1255 -0.1332 0.1062 0.0854 0.0853 0.0948 0.0886 0.1051 0.0939 0.0846 0.0923 0.0840 0.0866 0.0783 0.0893 0.0857 0.0827 0.0986 0.1127 0.1430 0.1346 0.0983 0.1095 0.1059 0.1199 0.1230 0.1277 0.1242
va: 2.1295 2.1009 2.3114 3.7526 3.8192 3.8348 3.9032 3.9080 3.8994 4.1906 3.7364 3.9419 3.9406 3.9059 3.6997 4.0077 3.9984 3.5890 3.8855 3.5878 4.0159 3.9827 3.9563 3.9463 3.9661 1.0254 1.0315 1.0050 1.0063 1.0013 0.9928 1.0194 1.0033 1.0096 0.9992 0.9985 1.0097 1.0020 1.0009 1.0193 0.9969 1.0056 1.0246 1.0069 1.0139 1.0078 1.0128 1.0044 1.0003 0.9983 0.9996
dispcorr: -0.025190581 hartree
energy: -1079.756628717230
dipole: 21.12845 -20.80809 0.32036 15.92549 -15.95504 -0.02955 -3.95958 4.35701 0.39743
magnitude: 0.51133 au
magnitude: 1.29969 debye
