program: Orca
programVersion: 5.0.2
elementType: O O O C C C C C C C C C C C C C C C C C C C C C C H H H H H H H H H H H H H H H H H H H H H H H H H H
charge: 0
multiplicity: 1
keywords: wb97x-d3
keywords: def2-TZVPP
keywords: def2/J RIJCOSX
keywords: DEFGRID2
keywords: scfconv7
keywords: smallprint printgap noloewdin
keywords: NOSOSCF
formula: C22H26O3
InChI: InChI=1/C22H26O3/c1-15(2)10-19-20(22(19,3)4)21(23)25-14-17-12-18(24-13-17)11-16-8-6-5-7-9-16/h5-10,12-13,19-20H,11,14H2,1-4H3
51 atoms
O  1.218634 -1.11723 0.067172
O  3.293699 -1.845059 0.469852
O  -2.890538 -1.913614 1.378851
C  3.998116 0.363853 -1.676397
C  4.32677 0.841327 -0.303241
C  2.947723 0.278848 -0.580949
C  3.717585 1.381046 -2.757438
C  4.670216 -0.884589 -2.192887
C  4.496496 2.281441 0.020566
C  2.548523 -1.004781 0.03443
C  4.175038 2.845795 1.185593
C  4.395583 4.306744 1.436196
C  3.571661 2.085619 2.326706
C  0.67756 -2.293235 0.673369
C  -0.799398 -2.153461 0.675928
C  -1.674283 -2.120201 -0.455539
C  -1.603925 -2.020097 1.755047
C  -2.928258 -1.971387 0.031329
C  -4.252748 -1.828207 -0.625428
C  -4.852543 -0.45414 -0.437778
C  -6.027688 -0.277124 0.27966
C  -4.224706 0.662145 -0.982758
C  -6.572642 0.989109 0.446724
C  -4.765606 1.926593 -0.819931
C  -5.943412 2.093989 -0.103619
H  4.959227 0.161063 0.262558
H  2.144525 1.002206 -0.663634
H  3.199737 2.261999 -2.377987
H  3.096497 0.944818 -3.541509
H  4.646969 1.716502 -3.222811
H  4.040872 -1.393314 -2.925833
H  4.906377 -1.593841 -1.403509
H  5.604104 -0.618184 -2.691314
H  4.940874 2.906714 -0.748749
H  4.81461 4.813568 0.567681
H  3.458804 4.805506 1.697477
H  5.075414 4.463258 2.277365
H  3.50498 1.016192 2.139412
H  4.15802 2.228075 3.237694
H  2.565204 2.451804 2.546253
H  1.060261 -2.409767 1.690352
H  0.990653 -3.175762 0.10908
H  -1.396679 -2.191872 -1.494944
H  -1.403018 -1.989748 2.814008
H  -4.944581 -2.587659 -0.249774
H  -4.119483 -2.035308 -1.689858
H  -6.523536 -1.137006 0.714304
H  -3.298134 0.539404 -1.53176
H  -7.489592 1.109994 1.008768
H  -4.266278 2.784886 -1.250676
H  -6.366474 3.081756 0.024466
totalener: -1079.73208854 hartree
nucrepener: 2042.72737351 hartree
electener: -3122.45946204 hartree
oneelecener: -5523.60761878 hartree
twoeener: 2401.14815674 hartree
kineticenergy: 1074.90271359 hartree
xcener: -106.462870710882 hartree
chargesum: -0.0000000
charge: -0.250698 -0.390079 -0.248756 0.127709 -0.024162 -0.089613 -0.274867 -0.257507 -0.236350 0.317086 -0.000994 -0.211797 -0.228574 0.058285 -0.026694 -0.266565 -0.030920 0.208079 -0.128170 0.060715 -0.143392 -0.153932 -0.123644 -0.128937 -0.130986 0.103728 0.084918 0.084706 0.090437 0.090334 0.084003 0.101245 0.083967 0.092851 0.077830 0.084710 0.086981 0.081190 0.088508 0.089350 0.089804 0.101818 0.128355 0.137085 0.093976 0.109731 0.104402 0.113393 0.123575 0.123387 0.124480
qa: -0.2507 -0.3901 -0.2488 0.1277 -0.0242 -0.0896 -0.2749 -0.2575 -0.2364 0.3171 -0.0010 -0.2118 -0.2286 0.0583 -0.0267 -0.2666 -0.0309 0.2081 -0.1282 0.0607 -0.1434 -0.1539 -0.1236 -0.1289 -0.1310 0.1037 0.0849 0.0847 0.0904 0.0903 0.0840 0.1012 0.0840 0.0929 0.0778 0.0847 0.0870 0.0812 0.0885 0.0893 0.0898 0.1018 0.1284 0.1371 0.0940 0.1097 0.1044 0.1134 0.1236 0.1234 0.1245
va: 2.1238 2.1111 2.3123 3.7411 3.8250 3.8291 3.9113 3.8989 3.9002 4.2078 3.7311 3.9423 3.9441 3.8761 3.7363 4.0272 3.9827 3.6360 3.8871 3.6558 4.0010 3.9910 3.9626 3.9723 3.9601 1.0276 1.0316 1.0047 1.0065 1.0011 1.0020 1.0208 1.0024 1.0095 1.0098 0.9986 0.9988 1.0178 1.0019 1.0001 1.0063 0.9935 1.0179 1.0078 1.0116 1.0044 1.0119 1.0119 1.0008 1.0009 1.0000
dispcorr: -0.021804807 hartree
energy: -1079.753893344086
dipole: 21.93855 -22.42272 -0.48417 16.02763 -15.53593 0.49170 -4.45922 4.17979 -0.27942
magnitude: 0.74449 au
magnitude: 1.89235 debye
