program: Orca
programVersion: 5.0.2
elementType: O O O C C C C C C C C C C C C C C C C C C C C C C H H H H H H H H H H H H H H H H H H H H H H H H H H
charge: 0
multiplicity: 1
keywords: wb97x-d3
keywords: def2-TZVPP
keywords: def2/J RIJCOSX
keywords: DEFGRID2
keywords: scfconv7
keywords: smallprint printgap noloewdin
keywords: NOSOSCF
formula: C22H26O3
InChI: InChI=1/C22H26O3/c1-15(2)10-19-20(22(19,3)4)21(23)25-14-17-12-18(24-13-17)11-16-8-6-5-7-9-16/h5-10,12-13,19-20H,11,14H2,1-4H3
51 atoms
O  1.019622 -1.116732 0.250719
O  3.116427 -1.800054 0.613295
O  -3.062308 -2.130725 1.522407
C  3.779912 0.497617 -1.426049
C  4.039011 0.965185 -0.027453
C  2.704824 0.348252 -0.361584
C  3.495035 1.527247 -2.492713
C  4.528964 -0.705861 -1.943302
C  4.110659 2.402629 0.343256
C  2.34549 -0.965867 0.215211
C  5.160239 3.193393 0.116999
C  5.170165 4.626766 0.553934
C  6.406227 2.723817 -0.570083
C  0.516714 -2.335814 0.801771
C  -0.963805 -2.242533 0.809808
C  -1.838044 -2.143008 -0.318435
C  -1.773478 -2.226148 1.893025
C  -3.096646 -2.076646 0.174682
C  -4.425332 -1.928396 -0.471887
C  -5.098404 -0.617984 -0.137028
C  -6.290492 -0.587851 0.573847
C  -4.527385 0.586101 -0.539028
C  -6.907217 0.619243 0.874066
C  -5.14012 1.792256 -0.243217
C  -6.334822 1.812557 0.464439
H  4.685435 0.306369 0.547724
H  1.868881 1.031912 -0.464467
H  4.4268 1.924479 -2.900295
H  2.921252 2.371734 -2.11432
H  2.935966 1.081157 -3.316904
H  3.942614 -1.241046 -2.692684
H  4.792409 -1.410111 -1.1587
H  5.453045 -0.380694 -2.425805
H  3.248997 2.819949 0.856863
H  5.326667 5.295507 -0.296195
H  4.238658 4.913633 1.040561
H  5.986958 4.818438 1.254467
H  6.341276 1.689692 -0.902838
H  6.626539 3.345299 -1.441666
H  7.269722 2.807426 0.094958
H  0.903265 -2.4877 1.812598
H  0.857189 -3.180561 0.196745
H  -1.557346 -2.117806 -1.359187
H  -1.573732 -2.276504 2.951381
H  -5.077343 -2.759721 -0.188812
H  -4.279738 -2.008584 -1.551589
H  -6.742435 -1.517044 0.899954
H  -3.589922 0.577317 -1.083156
H  -7.835123 0.625038 1.43114
H  -4.685089 2.719881 -0.565365
H  -6.814154 2.754631 0.695994
totalener: -1079.73215295 hartree
nucrepener: 2017.50991761 hartree
electener: -3097.24207056 hartree
oneelecener: -5473.17312355 hartree
twoeener: 2375.93105299 hartree
kineticenergy: 1074.91044057 hartree
xcener: -106.464310575546 hartree
chargesum: -0.0000000
charge: -0.253628 -0.389789 -0.248561 0.063786 -0.027990 -0.078207 -0.245227 -0.263678 -0.185665 0.331716 -0.023658 -0.211157 -0.245388 0.059296 -0.026336 -0.267380 -0.030774 0.206052 -0.125891 0.058759 -0.141140 -0.154935 -0.124520 -0.128914 -0.130514 0.107759 0.081933 0.083575 0.083888 0.094895 0.087334 0.104778 0.079840 0.090057 0.083553 0.079678 0.086336 0.083901 0.086898 0.098690 0.089995 0.102115 0.128278 0.136967 0.094162 0.108950 0.104744 0.113504 0.123211 0.124009 0.124693
qa: -0.2536 -0.3898 -0.2486 0.0638 -0.0280 -0.0782 -0.2452 -0.2637 -0.1857 0.3317 -0.0237 -0.2112 -0.2454 0.0593 -0.0263 -0.2674 -0.0308 0.2061 -0.1259 0.0588 -0.1411 -0.1549 -0.1245 -0.1289 -0.1305 0.1078 0.0819 0.0836 0.0839 0.0949 0.0873 0.1048 0.0798 0.0901 0.0836 0.0797 0.0863 0.0839 0.0869 0.0987 0.0900 0.1021 0.1283 0.1370 0.0942 0.1090 0.1047 0.1135 0.1232 0.1240 0.1247
va: 2.1309 2.1154 2.3122 3.7339 3.8125 3.8616 3.9096 3.9047 3.8576 4.2391 3.7370 3.9383 3.9361 3.8758 3.7381 4.0279 3.9828 3.6381 3.8865 3.6586 3.9988 3.9921 3.9638 3.9701 3.9597 1.0267 1.0333 1.0023 1.0069 1.0061 1.0028 1.0220 1.0026 1.0127 0.9990 1.0105 0.9980 1.0107 0.9989 1.0035 1.0059 0.9930 1.0184 1.0079 1.0105 1.0046 1.0116 1.0119 1.0008 1.0007 0.9999
dispcorr: -0.021989586 hartree
energy: -1079.754142532840
dipole: 28.04154 -28.30977 -0.26823 18.24081 -17.70785 0.53296 -10.48078 10.01671 -0.46407
magnitude: 0.75588 au
magnitude: 1.92130 debye
