program: Orca
programVersion: 5.0.2
elementType: O O O C C C C C C C C C C C C C C C C C C C C C C H H H H H H H H H H H H H H H H H H H H H H H H H H
charge: 0
multiplicity: 1
keywords: wb97x-d3
keywords: def2-TZVPP
keywords: def2/J RIJCOSX
keywords: DEFGRID2
keywords: scfconv7
keywords: smallprint printgap noloewdin
keywords: NOSOSCF
formula: C22H26O3
InChI: InChI=1/C22H26O3/c1-15(2)10-19-20(22(19,3)4)21(23)25-14-17-12-18(24-13-17)11-16-8-6-5-7-9-16/h5-10,12-13,19-20H,11,14H2,1-4H3
51 atoms
O  1.929621 -2.274154 -0.795364
O  1.920279 -1.711144 1.369896
O  -2.322169 -2.106006 -0.994689
C  3.588779 0.775764 0.504788
C  2.141372 1.115154 0.382738
C  2.677991 -0.146909 -0.276409
C  4.578542 1.545217 -0.338682
C  4.143202 0.373295 1.849588
C  1.65205 2.251785 -0.437917
C  2.164783 -1.437756 0.222623
C  0.613595 2.222829 -1.275869
C  0.201602 3.447587 -2.035511
C  -0.220942 1.007873 -1.539634
C  1.069157 -3.389757 -0.534817
C  -0.338779 -2.918891 -0.418783
C  -1.013847 -2.45511 0.754572
C  -1.192879 -2.680171 -1.442754
C  -2.205841 -1.964651 0.343662
C  -3.278675 -1.221169 1.053895
C  -3.126435 0.272608 0.871404
C  -3.994022 0.991482 0.060295
C  -2.077495 0.945346 1.492297
C  -3.823452 2.357639 -0.123689
C  -1.903174 2.306833 1.312162
C  -2.778559 3.018793 0.502449
H  1.562081 0.912361 1.281352
H  2.784489 -0.098182 -1.353754
H  5.480857 0.954328 -0.504468
H  4.876568 2.468709 0.161988
H  4.172904 1.814446 -1.313867
H  3.412743 -0.133551 2.473442
H  4.485429 1.262103 2.383138
H  5.001723 -0.290562 1.733576
H  2.181679 3.192596 -0.311365
H  0.213958 3.263508 -3.112869
H  -0.822578 3.731872 -1.78099
H  0.850966 4.298613 -1.832817
H  -1.280918 1.242276 -1.423313
H  -0.086011 0.664868 -2.569094
H  0.002555 0.175404 -0.878024
H  1.387534 -3.930751 0.357117
H  1.197105 -4.046245 -1.394687
H  -0.636472 -2.467596 1.763332
H  -1.12621 -2.858151 -2.504177
H  -3.221459 -1.473354 2.114696
H  -4.263774 -1.544864 0.70942
H  -4.810677 0.480419 -0.435362
H  -1.380005 0.39312 2.111615
H  -4.509484 2.904193 -0.757725
H  -1.077152 2.812886 1.7937
H  -2.644305 4.083422 0.361701
totalener: -1079.72943153 hartree
nucrepener: 2275.70218575 hartree
electener: -3355.43161728 hartree
oneelecener: -5989.90211195 hartree
twoeener: 2634.47049467 hartree
kineticenergy: 1074.92103439 hartree
xcener: -106.471833081938 hartree
chargesum: -0.0000000
charge: -0.262791 -0.401976 -0.244071 0.149378 -0.024858 -0.101229 -0.272180 -0.260754 -0.253183 0.333700 0.000925 -0.213117 -0.177294 0.055324 -0.075616 -0.238628 -0.036919 0.207303 -0.129026 0.076147 -0.148182 -0.171747 -0.094860 -0.089841 -0.195981 0.092585 0.088375 0.091284 0.088265 0.086055 0.100250 0.079968 0.083823 0.091790 0.087929 0.083489 0.078123 0.091753 0.101710 0.035195 0.110959 0.102130 0.142463 0.133639 0.113253 0.094559 0.105444 0.110786 0.123414 0.121402 0.130833
qa: -0.2628 -0.4020 -0.2441 0.1494 -0.0249 -0.1012 -0.2722 -0.2608 -0.2532 0.3337 0.0009 -0.2131 -0.1773 0.0553 -0.0756 -0.2386 -0.0369 0.2073 -0.1290 0.0761 -0.1482 -0.1717 -0.0949 -0.0898 -0.1960 0.0926 0.0884 0.0913 0.0883 0.0861 0.1003 0.0800 0.0838 0.0918 0.0879 0.0835 0.0781 0.0918 0.1017 0.0352 0.1110 0.1021 0.1425 0.1336 0.1133 0.0946 0.1054 0.1108 0.1234 0.1214 0.1308
va: 2.1170 2.0892 2.2973 3.7312 3.8235 3.8431 3.9074 3.8943 3.8403 4.1990 3.7664 3.9363 3.9133 3.8987 3.7068 3.9843 3.9594 3.6190 3.8806 3.6055 4.0017 3.9362 3.9124 3.8757 3.9322 1.0254 1.0318 1.0062 1.0024 1.0054 1.0246 1.0014 1.0028 1.0112 1.0005 1.0015 1.0096 0.9991 1.0086 1.0240 1.0073 0.9957 1.0226 1.0073 1.0062 1.0170 1.0128 1.0140 1.0007 1.0041 0.9992
dispcorr: -0.030864964 hartree
energy: -1079.760296494934
dipole: 11.13592 -11.34438 -0.20846 16.79505 -16.56954 0.22551 -2.85766 2.34029 -0.51736
magnitude: 0.60165 au
magnitude: 1.52926 debye
