program: Orca
programVersion: 5.0.2
elementType: O O O C C C C C C C C C C C C C C C C C C C H H H H H H H H H H H H H H H H H H H H H H H H
charge: 0
multiplicity: 1
keywords: wb97x-d3
keywords: def2-TZVPP
keywords: def2/J RIJCOSX
keywords: DEFGRID2
keywords: scfconv7
keywords: smallprint printgap noloewdin
keywords: NOSOSCF
formula: C19H24O3
InChI: InChI=1/C19H24O3/c1-7-8-13-12(4)16(10-15(13)20)22-18(21)17-14(9-11(2)3)19(17,5)6/h1,9,14,16-17H,8,10H2,2-6H3
46 atoms
O  -0.509799 -0.247995 0.793059
O  -1.475462 -0.733574 2.739459
O  3.817506 -1.66519 1.779053
C  -3.438333 0.230451 -0.087389
C  -2.919393 -1.022049 -0.715768
C  -2.795867 -0.841951 0.786446
C  -2.755449 1.559227 -0.296486
C  -4.93422 0.362618 0.067486
C  -1.747011 -1.100478 -1.626635
C  -1.548975 -0.608265 1.535175
C  -1.66209 -0.53043 -2.830959
C  0.715982 0.077328 1.449278
C  -0.441756 -0.71146 -3.682815
C  -2.736215 0.318773 -3.437059
C  1.463987 -1.118134 2.028788
C  1.640064 0.647125 0.405548
C  2.849826 0.070865 0.453562
C  2.857384 -0.991395 1.461069
C  1.197702 1.735834 -0.496753
C  4.058894 0.425581 -0.359658
C  4.665622 1.676445 0.080799
C  5.142664 2.71418 0.455923
H  -3.696311 -1.745989 -0.954244
H  -3.499208 -1.409826 1.384385
H  -3.27707 2.116982 -1.075802
H  -2.798043 2.161239 0.613528
H  -1.715762 1.480524 -0.600535
H  -5.413437 -0.60113 0.242441
H  -5.185183 1.018501 0.90324
H  -5.372329 0.794465 -0.835063
H  -0.922629 -1.728877 -1.305994
H  0.525873 0.838973 2.211971
H  1.031046 -2.063306 1.690894
H  1.483739 -1.135307 3.117711
H  -0.691676 -1.186139 -4.635059
H  0.006985 0.254387 -3.929307
H  0.317348 -1.319349 -3.191039
H  -3.011906 -0.068123 -4.421506
H  -3.640731 0.366456 -2.833862
H  -2.381818 1.339985 -3.598442
H  0.623667 2.487102 0.04734
H  0.542385 1.337172 -1.276143
H  2.034492 2.228091 -0.988314
H  4.796262 -0.377638 -0.29575
H  3.792205 0.512019 -1.415726
H  5.567809 3.634294 0.789391
elementType: O C H
totalener: -964.15729975 hartree
nucrepener: 1834.90473645 hartree
electener: -2799.06203620 hartree
oneelecener: -4953.90020435 hartree
twoeener: 2154.83816814 hartree
cpcmener: -0.04120172 hartree
kineticenergy: 959.77417930 hartree
xcener: -94.700978009002 hartree
chargesum: 0.0000000
charge: -0.275424 -0.502247 -0.481904 0.070719 0.025261 -0.092138 -0.283874 -0.275652 -0.276959 0.417465 -0.023963 0.218586 -0.242956 -0.262558 -0.136953 0.007465 -0.105355 0.322902 -0.287988 -0.106880 -0.461631 0.044213 0.115580 0.095505 0.099487 0.118959 0.082446 0.088743 0.098990 0.091799 0.110815 0.115569 0.109994 0.103706 0.106769 0.093751 0.091226 0.107321 0.093025 0.100652 0.121414 0.114696 0.110263 0.111294 0.136233 0.291636
qa: -0.2754 -0.5022 -0.4819 0.0707 0.0253 -0.0921 -0.2839 -0.2757 -0.2770 0.4175 -0.0240 0.2186 -0.2430 -0.2626 -0.1370 0.0075 -0.1054 0.3229 -0.2880 -0.1069 -0.4616 0.0442 0.1156 0.0955 0.0995 0.1190 0.0824 0.0887 0.0990 0.0918 0.1108 0.1156 0.1100 0.1037 0.1068 0.0938 0.0912 0.1073 0.0930 0.1007 0.1214 0.1147 0.1103 0.1113 0.1362 0.2916
va: 2.1230 2.0000 2.0185 3.7305 3.7438 3.8909 3.8871 3.9135 3.8506 4.0925 3.6813 3.7656 3.9204 3.9360 3.9066 3.6927 3.5321 4.0388 3.9640 3.8766 3.8200 3.5262 1.0048 1.0269 1.0010 1.0014 1.0025 1.0059 1.0004 1.0028 1.0214 1.0139 1.0192 1.0254 0.9980 0.9951 1.0060 1.0010 1.0053 0.9951 0.9980 0.9883 1.0050 1.0187 0.9889 0.9438
dispcorr: -0.025479185 hartree
energy: -964.182778938444
dipole: -19.83734 17.88828 -1.94907 8.23609 -6.60889 1.62720 -19.52166 17.08217 -2.43949
magnitude: 3.52104 au
magnitude: 8.94978 debye
