program: Orca
programVersion: 5.0.2
elementType: O O O C C C C C C C C C C C C C C C C C C C H H H H H H H H H H H H H H H H H H H H H H H H
charge: 0
multiplicity: 1
keywords: wb97x-d3
keywords: def2-TZVPP
keywords: def2/J RIJCOSX
keywords: DEFGRID2
keywords: scfconv7
keywords: smallprint printgap noloewdin
keywords: NOSOSCF
formula: C19H24O3
InChI: InChI=1/C19H24O3/c1-7-8-13-12(4)16(10-15(13)20)22-18(21)17-14(9-11(2)3)19(17,5)6/h1,9,14,16-17H,8,10H2,2-6H3
46 atoms
O  -0.177958 -0.732936 1.017009
O  -1.407545 1.140565 1.009946
O  4.016534 -1.544022 2.717071
C  -3.749619 -0.670847 0.068005
C  -3.028149 -0.29201 -1.176912
C  -2.246626 -0.872369 0.012643
C  -4.378822 0.372744 0.957015
C  -4.543764 -1.956106 0.034963
C  -2.860736 1.112183 -1.621409
C  -1.28074 -0.028597 0.72598
C  -2.005095 1.508044 -2.568494
C  0.911531 -0.098186 1.690521
C  -1.937912 2.937145 -3.01094
C  -1.053673 0.583519 -3.262898
C  1.633197 -1.109073 2.571167
C  1.952379 0.372808 0.703555
C  3.167685 -0.10902 1.004944
C  3.082039 -0.994851 2.167881
C  1.601166 1.279268 -0.413401
C  4.459153 0.170716 0.296139
C  4.545133 -0.529509 -0.979826
C  4.593559 -1.099713 -2.036991
H  -3.099434 -1.013506 -1.98543
H  -1.923272 -1.898614 -0.112983
H  -3.867281 1.330394 0.960059
H  -5.404871 0.550868 0.62995
H  -4.423026 0.01711 1.987804
H  -4.086034 -2.70174 -0.615882
H  -4.626961 -2.389065 1.033463
H  -5.554801 -1.769973 -0.332065
H  -3.507227 1.858697 -1.170885
H  0.548962 0.750101 2.275131
H  1.288692 -2.127276 2.376887
H  1.50654 -0.918908 3.636907
H  -2.114227 3.023044 -4.086225
H  -2.668418 3.562313 -2.49812
H  -0.94486 3.355675 -2.827606
H  -1.038493 -0.419545 -2.840404
H  -1.304538 0.497249 -4.323736
H  -0.03596 0.97921 -3.222219
H  0.915032 0.787282 -1.106936
H  2.475203 1.593185 -0.980504
H  1.090864 2.169698 -0.042522
H  4.569429 1.243917 0.121875
H  5.299659 -0.123985 0.92837
H  4.640762 -1.610474 -2.972262
elementType: O C H
totalener: -964.16048099 hartree
nucrepener: 1804.76917036 hartree
electener: -2768.92965136 hartree
oneelecener: -4894.45208564 hartree
twoeener: 2125.52243429 hartree
cpcmener: -0.03936758 hartree
kineticenergy: 959.77030429 hartree
xcener: -94.699135247052 hartree
chargesum: -0.0000000
charge: -0.298568 -0.491859 -0.481138 0.137596 -0.027016 -0.089420 -0.298937 -0.263385 -0.255624 0.388647 -0.033999 0.243395 -0.227866 -0.286280 -0.134921 0.000651 -0.099157 0.313436 -0.275036 -0.101570 -0.460935 0.038683 0.114234 0.093354 0.090382 0.101275 0.102594 0.088878 0.096498 0.094554 0.127519 0.108196 0.104785 0.101945 0.096301 0.089912 0.094843 0.096252 0.117385 0.094311 0.122480 0.106022 0.121736 0.135436 0.111944 0.292469
qa: -0.2986 -0.4919 -0.4811 0.1376 -0.0270 -0.0894 -0.2989 -0.2634 -0.2556 0.3886 -0.0340 0.2434 -0.2279 -0.2863 -0.1349 0.0007 -0.0992 0.3134 -0.2750 -0.1016 -0.4609 0.0387 0.1142 0.0934 0.0904 0.1013 0.1026 0.0889 0.0965 0.0946 0.1275 0.1082 0.1048 0.1019 0.0963 0.0899 0.0948 0.0963 0.1174 0.0943 0.1225 0.1060 0.1217 0.1354 0.1119 0.2925
va: 2.1225 1.9902 2.0183 3.7600 3.7943 3.8674 3.8958 3.8938 3.8300 4.0827 3.6982 3.7890 3.9263 3.9461 3.9146 3.6979 3.5336 4.0310 3.9360 3.8793 3.8258 3.5350 1.0026 1.0310 1.0187 0.9986 0.9996 1.0043 1.0023 1.0024 1.0001 1.0286 1.0278 1.0233 0.9956 1.0075 0.9960 1.0039 0.9983 0.9953 0.9885 1.0055 1.0061 0.9891 1.0190 0.9436
dispcorr: -0.023281728 hartree
energy: -964.183762720758
dipole: -21.05970 19.48365 -1.57606 6.64687 -6.23412 0.41276 -14.34731 12.99127 -1.35604
magnitude: 2.11971 au
magnitude: 5.38788 debye
