program: Orca
programVersion: 5.0.2
elementType: O O O C C C C C C C C C C C C C C C C C C C H H H H H H H H H H H H H H H H H H H H H H H H
charge: 0
multiplicity: 1
keywords: wb97x-d3
keywords: def2-TZVPP
keywords: def2/J RIJCOSX
keywords: DEFGRID2
keywords: scfconv7
keywords: smallprint printgap noloewdin
keywords: NOSOSCF
formula: C19H24O3
InChI: InChI=1/C19H24O3/c1-7-8-13-12(4)16(10-15(13)20)22-18(21)17-14(9-11(2)3)19(17,5)6/h1,9,14,16-17H,8,10H2,2-6H3
46 atoms
O  -0.605345 0.071757 1.099831
O  -1.566438 -0.917572 2.849135
O  3.067919 -2.075566 0.129352
C  -3.280708 0.358042 -0.20567
C  -2.809277 -1.008724 -0.579961
C  -2.850195 -0.603104 0.891343
C  -2.487371 1.596419 -0.551128
C  -4.771909 0.599143 -0.255752
C  -1.525552 -1.298587 -1.272203
C  -1.634813 -0.495032 1.714155
C  -1.221655 -0.936512 -2.520541
C  0.679384 0.048421 1.733016
C  0.095931 -1.305865 -3.132368
C  -2.134082 -0.148376 -3.407333
C  1.334563 -1.325731 1.656252
C  1.54749 0.940603 0.880343
C  2.500544 0.244014 0.245192
C  2.399276 -1.176153 0.597935
C  1.288734 2.396979 0.814549
C  3.532207 0.764755 -0.710629
C  4.406487 1.757134 -0.098253
C  5.105625 2.586284 0.420072
H  -3.605746 -1.70984 -0.820111
H  -3.662683 -1.036358 1.462461
H  -2.514855 2.319038 0.26659
H  -1.448638 1.402712 -0.801334
H  -2.942784 2.077172 -1.418621
H  -5.074708 0.89526 -1.262205
H  -5.340159 -0.291704 0.014443
H  -5.061644 1.400026 0.427144
H  -0.803493 -1.904026 -0.731403
H  0.601262 0.430957 2.752962
H  0.64562 -2.136325 1.416991
H  1.817458 -1.582894 2.60158
H  0.630269 -0.4138 -3.469371
H  0.740924 -1.837942 -2.432595
H  -0.039991 -1.934499 -4.015739
H  -1.68725 0.813502 -3.670324
H  -2.296856 -0.678043 -4.349609
H  -3.108612 0.042096 -2.961786
H  0.225503 2.603384 0.685581
H  1.833815 2.883171 0.008543
H  1.585661 2.866374 1.75595
H  4.135822 -0.064581 -1.085924
H  3.046339 1.205283 -1.58554
H  5.731297 3.319734 0.877016
elementType: O C H
totalener: -964.15580566 hartree
nucrepener: 1865.80964443 hartree
electener: -2829.96545010 hartree
oneelecener: -5016.03123331 hartree
twoeener: 2186.06578321 hartree
cpcmener: -0.03982798 hartree
kineticenergy: 959.77960701 hartree
xcener: -94.700953385911 hartree
chargesum: -0.0000000
charge: -0.264986 -0.501827 -0.481209 0.089509 0.011692 -0.097872 -0.298395 -0.273240 -0.294709 0.401062 -0.008242 0.248368 -0.242111 -0.263978 -0.162023 -0.025251 -0.094878 0.318600 -0.259830 -0.109488 -0.469347 0.055733 0.112541 0.092969 0.119666 0.089202 0.100022 0.091611 0.088512 0.099503 0.127519 0.113127 0.106508 0.118841 0.095122 0.085891 0.105134 0.101243 0.108169 0.092650 0.111279 0.100501 0.125215 0.109768 0.135270 0.292160
qa: -0.2650 -0.5018 -0.4812 0.0895 0.0117 -0.0979 -0.2984 -0.2732 -0.2947 0.4011 -0.0082 0.2484 -0.2421 -0.2640 -0.1620 -0.0253 -0.0949 0.3186 -0.2598 -0.1095 -0.4693 0.0557 0.1125 0.0930 0.1197 0.0892 0.1000 0.0916 0.0885 0.0995 0.1275 0.1131 0.1065 0.1188 0.0951 0.0859 0.1051 0.1012 0.1082 0.0926 0.1113 0.1005 0.1252 0.1098 0.1353 0.2922
va: 2.1130 1.9963 2.0080 3.6817 3.7685 3.8842 3.8835 3.9126 3.8768 4.1276 3.6495 3.7506 3.9251 3.9377 3.9122 3.7290 3.5331 3.9868 3.9449 3.8995 3.8465 3.5094 1.0062 1.0258 0.9990 1.0014 1.0007 1.0036 1.0058 1.0001 1.0032 1.0168 1.0247 1.0149 0.9961 1.0108 0.9979 0.9954 1.0005 1.0048 1.0062 0.9991 0.9949 1.0220 0.9886 0.9435
dispcorr: -0.026237416 hartree
energy: -964.182043078727
dipole: -15.53249 14.26783 -1.26465 8.24304 -6.07015 2.17289 -15.51815 14.49802 -1.02013
magnitude: 2.71320 au
magnitude: 6.89641 debye
