program: Orca
programVersion: 5.0.2
elementType: O O O C C C C C C C C C C C C C C C C C C C H H H H H H H H H H H H H H H H H H H H H H H H
charge: 0
multiplicity: 1
keywords: wb97x-d3
keywords: def2-TZVPP
keywords: def2/J RIJCOSX
keywords: DEFGRID2
keywords: scfconv7
keywords: smallprint printgap noloewdin
keywords: NOSOSCF
formula: C19H24O3
InChI: InChI=1/C19H24O3/c1-7-8-13-12(4)16(10-15(13)20)22-18(21)17-14(9-11(2)3)19(17,5)6/h1,9,14,16-17H,8,10H2,2-6H3
46 atoms
O  -0.503274 -0.230648 0.783712
O  -1.462737 -0.733769 2.728245
O  3.808663 -1.699902 1.737265
C  -3.439241 0.237838 -0.088007
C  -2.923869 -1.016633 -0.718353
C  -2.790924 -0.832441 0.781923
C  -2.75543 1.564318 -0.30821
C  -4.933803 0.371682 0.081429
C  -1.755439 -1.098843 -1.634534
C  -1.540007 -0.6006 1.52807
C  -1.680875 -0.550693 -2.849744
C  0.722641 0.078746 1.446982
C  -0.467021 -0.745859 -3.708181
C  -2.762176 0.28392 -3.463195
C  1.463474 -1.129278 2.010163
C  1.653826 0.662497 0.416821
C  2.858374 0.076154 0.453783
C  2.857588 -1.01066 1.438447
C  1.222641 1.778196 -0.457601
C  4.074673 0.440566 -0.344657
C  4.676069 1.686017 0.117406
C  5.149334 2.720986 0.504613
H  -3.701799 -1.741039 -0.953368
H  -3.490568 -1.399476 1.385409
H  -3.289462 2.127792 -1.075352
H  -2.773901 2.166966 0.602631
H  -1.722803 1.47887 -0.634187
H  -5.414344 -0.591766 0.256619
H  -5.17586 1.022255 0.924505
H  -5.383979 0.809474 -0.812584
H  -0.925485 -1.716911 -1.308021
H  0.533424 0.827898 2.22262
H  1.021077 -2.069074 1.669733
H  1.488172 -1.154949 3.099211
H  -0.720219 -1.256292 -4.641431
H  -0.030135 0.215103 -3.993492
H  0.304629 -1.328791 -3.205057
H  -3.048772 -0.122879 -4.436906
H  -3.661206 0.342517 -2.852484
H  -2.412559 1.302808 -3.650047
H  0.683808 2.536945 0.112616
H  0.538883 1.413877 -1.228668
H  2.061233 2.257868 -0.958844
H  4.81323 -0.361623 -0.276011
H  3.821657 0.532658 -1.403918
H  5.573378 3.6384 0.846281
elementType: O C H
totalener: -964.16689475 hartree
nucrepener: 1832.43033504 hartree
electener: -2796.59722979 hartree
oneelecener: -4949.02689715 hartree
twoeener: 2152.42966736 hartree
cpcmener: -0.03338318 hartree
kineticenergy: 959.76932974 hartree
xcener: -94.696985291393 hartree
chargesum: 0.0000000
charge: -0.275374 -0.468520 -0.445244 0.069754 0.018642 -0.086405 -0.284866 -0.273385 -0.264357 0.391858 -0.027017 0.216333 -0.239225 -0.260602 -0.134939 0.000591 -0.094834 0.295717 -0.289815 -0.109281 -0.458057 0.048751 0.114114 0.093959 0.098638 0.118500 0.082544 0.087244 0.099210 0.090398 0.106949 0.111265 0.105656 0.102318 0.105054 0.091947 0.089853 0.106374 0.091669 0.099583 0.120166 0.114228 0.107905 0.111982 0.133877 0.286840
qa: -0.2754 -0.4685 -0.4452 0.0698 0.0186 -0.0864 -0.2849 -0.2734 -0.2644 0.3919 -0.0270 0.2163 -0.2392 -0.2606 -0.1349 0.0006 -0.0948 0.2957 -0.2898 -0.1093 -0.4581 0.0488 0.1141 0.0940 0.0986 0.1185 0.0825 0.0872 0.0992 0.0904 0.1069 0.1113 0.1057 0.1023 0.1051 0.0919 0.0899 0.1064 0.0917 0.0996 0.1202 0.1142 0.1079 0.1120 0.1339 0.2868
va: 2.1178 2.0418 2.0635 3.7280 3.7481 3.8813 3.8882 3.9145 3.8543 4.1294 3.6883 3.7694 3.9229 3.9362 3.8943 3.6891 3.5150 4.0693 3.9642 3.8782 3.8257 3.5311 1.0050 1.0273 1.0016 1.0015 1.0029 1.0062 1.0004 1.0032 1.0227 1.0149 1.0207 1.0262 0.9979 0.9958 1.0065 1.0011 1.0056 0.9957 0.9980 0.9884 1.0060 1.0190 0.9890 0.9470
dispcorr: -0.025305717 hartree
energy: -964.192200465928
dipole: -19.88860 18.06074 -1.82786 8.23406 -6.70022 1.53384 -19.42370 17.18741 -2.23630
magnitude: 3.27028 au
magnitude: 8.31240 debye
