program: Orca
programVersion: 5.0.2
elementType: O O O C C C C C C C C C C C C C C C C C C C H H H H H H H H H H H H H H H H H H H H H H H H
charge: 0
multiplicity: 1
keywords: wb97x-d3
keywords: def2-TZVPP
keywords: def2/J RIJCOSX
keywords: DEFGRID2
keywords: scfconv7
keywords: smallprint printgap noloewdin
keywords: NOSOSCF
formula: C19H24O3
InChI: InChI=1/C19H24O3/c1-7-8-13-12(4)16(10-15(13)20)22-18(21)17-14(9-11(2)3)19(17,5)6/h1,9,14,16-17H,8,10H2,2-6H3
46 atoms
O  -0.546912 -0.058003 1.294512
O  -1.783675 -1.317954 2.654446
O  3.045938 -2.086294 0.096852
C  -2.976941 0.641335 -0.306678
C  -2.580337 -0.705154 -0.820113
C  -2.782153 -0.496226 0.680243
C  -2.04459 1.827374 -0.377961
C  -4.424362 1.035357 -0.499524
C  -1.244435 -1.045582 -1.377627
C  -1.677858 -0.663205 1.642251
C  -0.729094 -0.576925 -2.516285
C  0.637077 -0.324853 2.057188
C  0.609764 -1.040617 -3.005385
C  -1.411211 0.422752 -3.397167
C  1.256188 -1.668376 1.690108
C  1.63396 0.701364 1.578192
C  2.59314 0.142047 0.829427
C  2.393274 -1.311591 0.760903
C  1.448739 2.134766 1.897799
C  3.693358 0.842457 0.090642
C  3.171413 1.594385 -1.044334
C  2.70147 2.212988 -1.961536
H  -3.394599 -1.279921 -1.2569
H  -3.698219 -0.91675 1.078578
H  -2.328099 2.45163 -1.227527
H  -2.132412 2.448093 0.515923
H  -0.999848 1.561206 -0.508454
H  -4.571089 1.487322 -1.483035
H  -5.096182 0.179035 -0.425807
H  -4.735237 1.766068 0.250126
H  -0.673411 -1.797414 -0.839972
H  0.428934 -0.221862 3.123865
H  0.562743 -2.373721 1.231853
H  1.670833 -2.156418 2.575501
H  1.092677 -1.723139 -2.305629
H  0.522456 -1.550117 -3.968599
H  1.282405 -0.193208 -3.163028
H  -1.493801 0.036604 -4.416712
H  -2.412825 0.683096 -3.059929
H  -0.82616 1.343634 -3.467236
H  0.543747 2.522424 1.425425
H  2.284568 2.748839 1.570499
H  1.321142 2.269279 2.973299
H  4.228086 1.521834 0.758997
H  4.428641 0.115055 -0.260337
H  2.295732 2.745814 -2.791719
elementType: O C H
totalener: -964.16519182 hartree
nucrepener: 1897.76684648 hartree
electener: -2861.93203829 hartree
oneelecener: -5080.48628505 hartree
twoeener: 2218.55424676 hartree
cpcmener: -0.03328605 hartree
kineticenergy: 959.77839248 hartree
xcener: -94.697075771626 hartree
chargesum: -0.0000000
charge: -0.265103 -0.468355 -0.444326 0.087521 0.003118 -0.099056 -0.275928 -0.271720 -0.278170 0.377209 -0.014116 0.238771 -0.238873 -0.257384 -0.158193 -0.029003 -0.085938 0.284933 -0.242599 -0.077780 -0.433678 -0.000510 0.109877 0.090958 0.096740 0.114827 0.077317 0.091207 0.087244 0.098508 0.125499 0.107314 0.102475 0.114648 0.087011 0.108415 0.084258 0.107058 0.090255 0.098496 0.112345 0.099551 0.116605 0.133538 0.111580 0.283456
qa: -0.2651 -0.4684 -0.4443 0.0875 0.0031 -0.0991 -0.2759 -0.2717 -0.2782 0.3772 -0.0141 0.2388 -0.2389 -0.2574 -0.1582 -0.0290 -0.0859 0.2849 -0.2426 -0.0778 -0.4337 -0.0005 0.1099 0.0910 0.0967 0.1148 0.0773 0.0912 0.0872 0.0985 0.1255 0.1073 0.1025 0.1146 0.0870 0.1084 0.0843 0.1071 0.0903 0.0985 0.1123 0.0996 0.1166 0.1335 0.1116 0.2835
va: 2.1098 2.0363 2.0454 3.6842 3.7797 3.8699 3.8787 3.9127 3.8663 4.1681 3.6524 3.7522 3.9220 3.9366 3.9126 3.7536 3.5213 4.0188 3.9448 3.8708 3.8104 3.5885 1.0065 1.0265 1.0016 1.0006 1.0050 1.0038 1.0059 1.0007 1.0034 1.0204 1.0269 1.0165 1.0135 1.0004 0.9991 1.0009 1.0049 0.9964 0.9978 1.0024 1.0005 0.9898 1.0183 0.9509
dispcorr: -0.027599485 hartree
energy: -964.192791300161
dipole: -11.18104 10.62210 -0.55894 10.81400 -8.70588 2.10812 -12.91192 12.90286 -0.00906
magnitude: 2.18098 au
magnitude: 5.54360 debye
