program: Orca
programVersion: 5.0.2
elementType: O O O C C C C C C C C C C C C C C C C C C C H H H H H H H H H H H H H H H H H H H H H H H H
charge: 0
multiplicity: 1
keywords: wb97x-d3
keywords: def2-TZVPP
keywords: def2/J RIJCOSX
keywords: DEFGRID2
keywords: scfconv7
keywords: smallprint printgap noloewdin
keywords: NOSOSCF
formula: C19H24O3
InChI: InChI=1/C19H24O3/c1-7-8-13-12(4)16(10-15(13)20)22-18(21)17-14(9-11(2)3)19(17,5)6/h1,9,14,16-17H,8,10H2,2-6H3
46 atoms
O  -0.261907 -0.499418 1.169595
O  -1.263852 1.356037 0.412703
O  3.918232 -0.872903 3.130588
C  -3.855018 -0.36053 0.353722
C  -3.203074 -0.556881 -0.970105
C  -2.390462 -0.757074 0.318468
C  -4.290107 1.006651 0.819284
C  -4.783136 -1.455538 0.827523
C  -2.927816 0.555384 -1.91074
C  -1.289898 0.16793 0.624673
C  -2.132747 0.466409 -2.980625
C  0.944183 0.200446 1.474966
C  -1.95283 1.623553 -3.915007
C  -1.358907 -0.765242 -3.339043
C  1.578569 -0.35291 2.742742
C  1.974999 -0.025141 0.395242
C  3.145006 -0.428186 0.912241
C  3.022181 -0.589007 2.365455
C  1.656587 0.231938 -1.028321
C  4.428393 -0.689117 0.179949
C  5.016275 0.52538 -0.372107
C  5.490967 1.523119 -0.844914
H  -3.422346 -1.506179 -1.450306
H  -2.183442 -1.788579 0.578189
H  -5.310004 1.198153 0.479344
H  -4.296956 1.051879 1.910099
H  -3.667906 1.821935 0.462391
H  -5.79652 -1.284842 0.458219
H  -4.466495 -2.439812 0.479763
H  -4.828136 -1.486443 1.918058
H  -3.439827 1.495732 -1.732873
H  0.743399 1.270219 1.569054
H  1.129578 -1.309217 3.023298
H  1.494309 0.314449 3.600441
H  -0.907594 1.943362 -3.944435
H  -2.218784 1.34852 -4.939312
H  -2.558951 2.483276 -3.62929
H  -0.308943 -0.521629 -3.520175
H  -1.39351 -1.536779 -2.571667
H  -1.734163 -1.202962 -4.268532
H  0.844733 -0.41835 -1.36248
H  2.509273 0.062206 -1.682527
H  1.315032 1.259551 -1.1698
H  5.146317 -1.156086 0.858542
H  4.263008 -1.407312 -0.627686
H  5.914354 2.416921 -1.244691
elementType: O C H
totalener: -964.17023125 hartree
nucrepener: 1794.97738336 hartree
electener: -2759.14761461 hartree
oneelecener: -4874.73208646 hartree
twoeener: 2115.58447184 hartree
cpcmener: -0.03186156 hartree
kineticenergy: 959.76276368 hartree
xcener: -94.695609574009 hartree
chargesum: -0.0000000
charge: -0.296217 -0.460829 -0.445900 0.134003 -0.029419 -0.085346 -0.298644 -0.259897 -0.238313 0.360524 -0.024004 0.242931 -0.225366 -0.301100 -0.136407 -0.011902 -0.091567 0.291928 -0.265055 -0.110187 -0.463451 0.055815 0.112475 0.090966 0.100428 0.100281 0.093597 0.094521 0.085967 0.095899 0.121248 0.106696 0.102009 0.097833 0.093162 0.094197 0.088914 0.094396 0.094830 0.116738 0.119903 0.102544 0.120101 0.111034 0.134081 0.286586
qa: -0.2962 -0.4608 -0.4459 0.1340 -0.0294 -0.0853 -0.2986 -0.2599 -0.2383 0.3605 -0.0240 0.2429 -0.2254 -0.3011 -0.1364 -0.0119 -0.0916 0.2919 -0.2651 -0.1102 -0.4635 0.0558 0.1125 0.0910 0.1004 0.1003 0.0936 0.0945 0.0860 0.0959 0.1212 0.1067 0.1020 0.0978 0.0932 0.0942 0.0889 0.0944 0.0948 0.1167 0.1199 0.1025 0.1201 0.1110 0.1341 0.2866
va: 2.1191 2.0264 2.0610 3.7659 3.8003 3.8515 3.8973 3.8935 3.8364 4.1286 3.6939 3.7837 3.9290 3.9545 3.9098 3.7112 3.5183 4.0614 3.9341 3.8786 3.8289 3.5238 1.0015 1.0316 0.9986 1.0001 1.0187 1.0023 1.0047 1.0025 1.0022 1.0314 1.0276 1.0250 0.9964 0.9958 1.0079 0.9941 1.0022 0.9988 0.9989 1.0046 1.0033 1.0199 0.9883 0.9470
dispcorr: -0.023097056 hartree
energy: -964.193328307858
dipole: -21.98986 20.29769 -1.69216 0.25400 -0.97932 -0.72532 -16.16731 14.67240 -1.49491
magnitude: 2.37155 au
magnitude: 6.02801 debye
