program: Orca
programVersion: 5.0.2
elementType: O O O C C C C C C C C C C C C C C C C C C C H H H H H H H H H H H H H H H H H H H H H H H H
charge: 0
multiplicity: 1
keywords: wb97x-d3
keywords: def2-TZVPP
keywords: def2/J RIJCOSX
keywords: DEFGRID2
keywords: scfconv7
keywords: smallprint printgap noloewdin
keywords: NOSOSCF
formula: C19H24O3
InChI: InChI=1/C19H24O3/c1-7-8-13-12(4)16(10-15(13)20)22-18(21)17-14(9-11(2)3)19(17,5)6/h1,9,14,16-17H,8,10H2,2-6H3
46 atoms
O  0.310211 -0.511017 0.576403
O  -1.423207 0.827647 1.041768
O  4.123801 -0.973902 3.143155
C  -3.072486 -1.46403 -0.319298
C  -2.793299 -0.498082 -1.428165
C  -1.650209 -0.975723 -0.53285
C  -3.873681 -1.035988 0.884824
C  -3.312749 -2.904144 -0.704756
C  -3.291919 0.891522 -1.434832
C  -0.958706 -0.107409 0.435406
C  -3.966012 1.470842 -2.435084
C  1.187004 0.176184 1.469421
C  -4.4207 2.895644 -2.321693
C  -4.338137 0.810147 -3.727562
C  1.791916 -0.770274 2.497376
C  2.359293 0.70617 0.686882
C  3.525391 0.329623 1.230851
C  3.280325 -0.531666 2.39359
C  2.142343 1.546318 -0.513569
C  4.906386 0.681401 0.766526
C  5.305777 -0.115719 -0.387338
C  5.614369 -0.78235 -1.338604
H  -2.735735 -0.959526 -2.407781
H  -0.990903 -1.697746 -0.999922
H  -3.788394 0.01976 1.125779
H  -4.930632 -1.242471 0.704834
H  -3.576688 -1.604667 1.768309
H  -4.364898 -3.065497 -0.948851
H  -2.722655 -3.198846 -1.573731
H  -3.05573 -3.577783 0.115596
H  -3.105642 1.491214 -0.552633
H  0.661613 1.0051 1.948481
H  1.581933 -1.813134 2.24686
H  1.432978 -0.598197 3.512375
H  -4.016459 3.502244 -3.136986
H  -5.509251 2.969019 -2.395597
H  -4.116412 3.354045 -1.380634
H  -4.055376 -0.238981 -3.79085
H  -5.418721 0.866372 -3.884712
H  -3.879448 1.330548 -4.572915
H  1.799159 0.932715 -1.350243
H  3.050061 2.057121 -0.830911
H  1.367592 2.293905 -0.332935
H  4.965201 1.741999 0.509346
H  5.620367 0.522668 1.578462
H  5.888835 -1.376639 -2.181001
elementType: O C H
totalener: -964.17074293 hartree
nucrepener: 1746.70137172 hartree
electener: -2710.87211465 hartree
oneelecener: -4778.21370620 hartree
twoeener: 2067.34159155 hartree
cpcmener: -0.03160422 hartree
kineticenergy: 959.76505250 hartree
xcener: -94.695460546334 hartree
chargesum: -0.0000000
charge: -0.298026 -0.470134 -0.444303 0.117008 0.029346 -0.127344 -0.285894 -0.261832 -0.301826 0.413490 -0.039105 0.244413 -0.222855 -0.255191 -0.134733 -0.018051 -0.091973 0.293133 -0.261406 -0.110228 -0.446850 0.039067 0.112839 0.096277 0.096995 0.097069 0.102736 0.094454 0.086957 0.093347 0.125183 0.104857 0.099559 0.099721 0.092148 0.092740 0.088822 0.088096 0.094382 0.096575 0.113934 0.106447 0.117781 0.132157 0.113108 0.287108
qa: -0.2980 -0.4701 -0.4443 0.1170 0.0293 -0.1273 -0.2859 -0.2618 -0.3018 0.4135 -0.0391 0.2444 -0.2229 -0.2552 -0.1347 -0.0181 -0.0920 0.2931 -0.2614 -0.1102 -0.4469 0.0391 0.1128 0.0963 0.0970 0.0971 0.1027 0.0945 0.0870 0.0933 0.1252 0.1049 0.0996 0.0997 0.0921 0.0927 0.0888 0.0881 0.0944 0.0966 0.1139 0.1064 0.1178 0.1322 0.1131 0.2871
va: 2.1245 2.0308 2.0629 3.7070 3.7411 3.9049 3.9121 3.9108 3.8561 4.0957 3.7636 3.7655 3.9251 3.9411 3.8990 3.7160 3.5226 4.0627 3.9379 3.8850 3.8322 3.5444 1.0053 1.0308 1.0129 1.0018 0.9992 1.0017 1.0052 1.0024 1.0243 1.0370 1.0280 1.0250 0.9959 0.9967 1.0087 1.0121 0.9973 0.9966 1.0008 1.0018 1.0037 0.9892 1.0180 0.9470
dispcorr: -0.020872237 hartree
energy: -964.191615162535
dipole: -27.94861 26.54401 -1.40460 2.82923 -2.52245 0.30678 -15.85494 14.05379 -1.80115
magnitude: 2.30459 au
magnitude: 5.85781 debye
