program: Orca
programVersion: 5.0.2
elementType: O O O C C C C C C C C C C C C C C C C C C C H H H H H H H H H H H H H H H H H H H H H H H H
charge: 0
multiplicity: 1
keywords: wb97x-d3
keywords: def2-TZVPP
keywords: def2/J RIJCOSX
keywords: DEFGRID2
keywords: scfconv7
keywords: smallprint printgap noloewdin
keywords: NOSOSCF
formula: C19H24O3
InChI: InChI=1/C19H24O3/c1-7-8-13-12(4)16(10-15(13)20)22-18(21)17-14(9-11(2)3)19(17,5)6/h1,9,14,16-17H,8,10H2,2-6H3
46 atoms
O  -0.46796 -0.226245 0.343722
O  -1.313383 -0.360177 2.408415
O  3.887415 -0.862825 -1.067334
C  -3.160651 1.014486 -0.432415
C  -3.186126 -0.425617 -0.811043
C  -2.802624 -0.028175 0.6161
C  -2.120544 1.949323 -1.000304
C  -4.488784 1.698662 -0.204181
C  -2.240171 -1.0337 -1.77734
C  -1.470959 -0.215327 1.216944
C  -1.999356 -2.345253 -1.843691
C  0.868987 -0.443276 0.794148
C  -1.082632 -2.92574 -2.875138
C  -2.627444 -3.313231 -0.87993
C  1.640833 -1.258891 -0.234639
C  1.622135 0.860087 0.902962
C  2.784893 0.809004 0.236597
C  2.920387 -0.484861 -0.441694
C  1.099358 1.98438 1.713909
C  3.84696 1.865693 0.164502
C  4.531678 2.055391 1.437396
C  5.084245 2.212886 2.49299
H  -4.177823 -0.872751 -0.832404
H  -3.575076 -0.196159 1.357738
H  -2.508235 2.411938 -1.910488
H  -1.904339 2.75487 -0.295648
H  -1.179374 1.472117 -1.258348
H  -5.234195 1.018363 0.210136
H  -4.384374 2.537776 0.486729
H  -4.884541 2.090465 -1.143612
H  -1.753517 -0.373875 -2.48936
H  0.859177 -0.940711 1.766872
H  1.101459 -1.310905 -1.184244
H  1.841929 -2.281872 0.083985
H  -1.602699 -3.661349 -3.495267
H  -0.667984 -2.163428 -3.535062
H  -0.249829 -3.457346 -2.406416
H  -3.702261 -3.416412 -1.051828
H  -2.192662 -4.308991 -0.969114
H  -2.504442 -2.992348 0.157041
H  0.945147 1.671037 2.748807
H  0.129463 2.31937 1.338425
H  1.769908 2.841503 1.714193
H  4.58027 1.592756 -0.598144
H  3.413464 2.816699 -0.156166
H  5.573857 2.348545 3.431171
elementType: O C H
totalener: -964.16615602 hartree
nucrepener: 1834.52683704 hartree
electener: -2798.69299306 hartree
oneelecener: -4953.41270332 hartree
twoeener: 2154.71971026 hartree
cpcmener: -0.03230545 hartree
kineticenergy: 959.76003553 hartree
xcener: -94.695045014204 hartree
chargesum: -0.0000000
charge: -0.258691 -0.472158 -0.445730 0.132700 -0.036507 -0.128507 -0.314650 -0.265938 -0.223229 0.399798 -0.045068 0.193115 -0.240434 -0.272416 -0.121496 -0.007938 -0.096089 0.294782 -0.246448 -0.114295 -0.459276 0.052566 0.114008 0.092032 0.106977 0.103864 0.090206 0.086419 0.096389 0.093548 0.123697 0.111560 0.094229 0.102829 0.111631 0.090372 0.093887 0.103972 0.096155 0.097183 0.119326 0.116917 0.097950 0.111205 0.134468 0.287086
qa: -0.2587 -0.4722 -0.4457 0.1327 -0.0365 -0.1285 -0.3146 -0.2659 -0.2232 0.3998 -0.0451 0.1931 -0.2404 -0.2724 -0.1215 -0.0079 -0.0961 0.2948 -0.2464 -0.1143 -0.4593 0.0526 0.1140 0.0920 0.1070 0.1039 0.0902 0.0864 0.0964 0.0935 0.1237 0.1116 0.0942 0.1028 0.1116 0.0904 0.0939 0.1040 0.0962 0.0972 0.1193 0.1169 0.0980 0.1112 0.1345 0.2871
va: 2.0977 2.0282 2.0635 3.7451 3.8013 3.8686 3.9027 3.9020 3.7698 4.1306 3.6945 3.7836 3.9139 3.9491 3.9017 3.7038 3.5126 4.0795 3.9455 3.8822 3.8265 3.5282 1.0014 1.0291 1.0016 0.9979 1.0114 1.0061 1.0015 1.0023 1.0002 1.0331 1.0328 1.0230 0.9953 1.0063 0.9928 0.9976 1.0054 0.9984 1.0036 0.9975 1.0041 1.0197 0.9879 0.9468
dispcorr: -0.024858325 hartree
energy: -964.191014342895
dipole: -19.30996 17.44354 -1.86642 -0.14925 0.92120 0.77195 -8.09176 7.68007 -0.41169
magnitude: 2.06129 au
magnitude: 5.23937 debye
