program: Orca
programVersion: 5.0.2
elementType: O O O C C C C C C C C C C C C C C C C C C C H H H H H H H H H H H H H H H H H H H H H H H H
charge: 0
multiplicity: 1
keywords: wb97x-d3
keywords: def2-TZVPP
keywords: def2/J RIJCOSX
keywords: DEFGRID2
keywords: scfconv7
keywords: smallprint printgap noloewdin
keywords: NOSOSCF
formula: C19H24O3
InChI: InChI=1/C19H24O3/c1-7-8-13-12(4)16(10-15(13)20)22-18(21)17-14(9-11(2)3)19(17,5)6/h1,9,14,16-17H,8,10H2,2-6H3
46 atoms
O  0.076151 -0.641043 0.931369
O  -1.26386 1.147994 0.8281
O  4.133864 -1.209838 3.018519
C  -3.447463 -0.931785 0.01902
C  -2.851704 -0.519931 -1.290545
C  -1.937703 -0.948505 -0.139054
C  -4.135027 0.073781 0.908586
C  -4.088557 -2.298467 0.079162
C  -2.900689 0.858566 -1.812017
C  -1.050804 -0.01347 0.5736
C  -3.161586 1.205899 -3.078369
C  1.063225 0.05534 1.694405
C  -3.19515 2.651257 -3.477864
C  -3.440619 0.255766 -4.203423
C  1.752363 -0.910091 2.649706
C  2.1641 0.579235 0.803673
C  3.370064 0.179078 1.232548
C  3.226004 -0.713712 2.38721
C  1.862429 1.448211 -0.35784
C  4.711768 0.528016 0.662943
C  5.073369 -0.341399 -0.449815
C  5.357422 -1.054382 -1.374627
H  -2.896266 -1.289143 -2.053107
H  -1.504973 -1.934565 -0.260472
H  -5.198025 0.103664 0.660908
H  -4.053692 -0.221518 1.956572
H  -3.754356 1.086928 0.82021
H  -3.581366 -3.016821 -0.566381
H  -4.070763 -2.694799 1.096592
H  -5.132048 -2.247109 -0.238662
H  -2.722089 1.662206 -1.107988
H  0.600927 0.885999 2.233011
H  1.484244 -1.946597 2.431148
H  1.511924 -0.725487 3.697139
H  -4.177416 2.927823 -3.870908
H  -2.967917 3.316327 -2.644617
H  -2.476805 2.855165 -4.276696
H  -4.409118 0.478513 -4.658726
H  -2.696799 0.370738 -4.99638
H  -3.451151 -0.792554 -3.912543
H  1.2631 0.911083 -1.096719
H  2.764318 1.797108 -0.857094
H  1.279262 2.318553 -0.05087
H  4.725672 1.56674 0.324937
H  5.473052 0.450229 1.443356
H  5.611806 -1.686972 -2.194922
elementType: O C H
totalener: -964.17131055 hartree
nucrepener: 1757.13021906 hartree
electener: -2721.30152961 hartree
oneelecener: -4799.14774347 hartree
twoeener: 2077.84621386 hartree
cpcmener: -0.03167589 hartree
kineticenergy: 959.75916840 hartree
xcener: -94.694679898297 hartree
chargesum: -0.0000000
charge: -0.294758 -0.469673 -0.444726 0.104008 0.033377 -0.099807 -0.284972 -0.261644 -0.297020 0.394418 -0.052685 0.248022 -0.217441 -0.254074 -0.132051 -0.031683 -0.091126 0.288574 -0.243193 -0.114477 -0.448083 0.044542 0.116262 0.094682 0.096657 0.101803 0.096370 0.086735 0.093577 0.094625 0.122758 0.103396 0.101036 0.099488 0.092808 0.088055 0.091632 0.095282 0.096779 0.087698 0.112489 0.101978 0.117537 0.130150 0.115879 0.286799
qa: -0.2948 -0.4697 -0.4447 0.1040 0.0334 -0.0998 -0.2850 -0.2616 -0.2970 0.3944 -0.0527 0.2480 -0.2174 -0.2541 -0.1321 -0.0317 -0.0911 0.2886 -0.2432 -0.1145 -0.4481 0.0445 0.1163 0.0947 0.0967 0.1018 0.0964 0.0867 0.0936 0.0946 0.1228 0.1034 0.1010 0.0995 0.0928 0.0881 0.0916 0.0953 0.0968 0.0877 0.1125 0.1020 0.1175 0.1301 0.1159 0.2868
va: 2.1287 2.0246 2.0619 3.7118 3.7379 3.8837 3.9080 3.9085 3.8524 4.1023 3.7873 3.7729 3.9222 3.9389 3.8984 3.7506 3.5133 4.0707 3.9395 3.8874 3.8353 3.5407 1.0023 1.0301 1.0014 0.9988 1.0137 1.0055 1.0022 1.0017 1.0226 1.0296 1.0292 1.0239 0.9964 1.0089 0.9963 0.9972 0.9967 1.0139 1.0002 1.0047 1.0055 0.9903 1.0142 0.9472
dispcorr: -0.021136000 hartree
energy: -964.192446547094
dipole: -26.50305 24.82186 -1.68119 4.34216 -4.07446 0.26770 -16.63425 15.29585 -1.33840
magnitude: 2.16550 au
magnitude: 5.50426 debye
