program: Orca
programVersion: 5.0.2
elementType: O O O C C C C C C C C C C C C C C C C C C C H H H H H H H H H H H H H H H H H H H H H H H H
charge: 0
multiplicity: 1
keywords: wb97x-d3
keywords: def2-TZVPP
keywords: def2/J RIJCOSX
keywords: DEFGRID2
keywords: scfconv7
keywords: smallprint printgap noloewdin
keywords: NOSOSCF
formula: C19H24O3
InChI: InChI=1/C19H24O3/c1-7-8-13-12(4)16(10-15(13)20)22-18(21)17-14(9-11(2)3)19(17,5)6/h1,9,14,16-17H,8,10H2,2-6H3
46 atoms
O  -0.012046 -0.696386 1.10777
O  -1.305522 1.128208 1.056001
O  4.123455 -1.340475 3.018011
C  -3.537859 -0.749425 0.000681
C  -2.756473 -0.449686 -1.240622
C  -2.033523 -0.919897 0.027911
C  -4.231872 0.354054 0.760263
C  -4.314215 -2.045483 0.017529
C  -2.589905 0.907429 -1.793573
C  -1.124261 -0.0319 0.771999
C  -2.704307 1.206073 -3.092131
C  1.02331 -0.021778 1.825561
C  -2.510549 2.609227 -3.57926
C  -3.020363 0.184188 -4.152206
C  1.735357 -0.998331 2.750723
C  2.092033 0.474657 0.881765
C  3.307658 0.042265 1.247789
C  3.199231 -0.834182 2.419247
C  1.75735 1.354262 -0.263129
C  4.624769 0.363117 0.605603
C  4.752493 -0.222059 -0.723437
C  4.835281 -0.699598 -1.823329
H  -2.789576 -1.234046 -1.98943
H  -1.68635 -1.94544 -0.016649
H  -4.295338 0.111305 1.822762
H  -3.758387 1.326755 0.670427
H  -5.253462 0.454264 0.388076
H  -4.46534 -2.39824 1.040074
H  -5.298496 -1.90829 -0.435091
H  -3.803736 -2.836395 -0.533892
H  -2.365642 1.713559 -1.105735
H  0.604849 0.820117 2.381908
H  1.437797 -2.030107 2.548412
H  1.547868 -0.806457 3.80758
H  -3.412172 2.982222 -4.073107
H  -2.259284 3.296813 -2.771429
H  -1.711294 2.658491 -4.324236
H  -3.225557 0.662225 -5.110314
H  -2.187568 -0.504735 -4.313723
H  -3.892858 -0.420895 -3.901268
H  1.153481 0.8179 -0.999778
H  2.644616 1.724987 -0.772884
H  1.166692 2.210848 0.065965
H  4.756116 1.446222 0.533976
H  5.438059 0.000201 1.23872
H  4.912795 -1.127513 -2.79743
elementType: O C H
totalener: -964.16974953 hartree
nucrepener: 1769.63469267 hartree
electener: -2733.80444219 hartree
oneelecener: -4824.12583203 hartree
twoeener: 2090.32138983 hartree
cpcmener: -0.03013855 hartree
kineticenergy: 959.75908870 hartree
xcener: -94.694434611527 hartree
chargesum: -0.0000000
charge: -0.293433 -0.466224 -0.445232 0.113079 0.059503 -0.110901 -0.286008 -0.264198 -0.351252 0.386461 0.004352 0.244634 -0.222501 -0.292854 -0.132505 -0.023028 -0.087958 0.283774 -0.252057 -0.102769 -0.460982 0.046442 0.113551 0.095538 0.101449 0.097701 0.095294 0.094005 0.094086 0.086821 0.122772 0.103519 0.101803 0.099592 0.095209 0.084758 0.097289 0.095654 0.104720 0.102200 0.115382 0.101027 0.119460 0.132896 0.111444 0.287487
qa: -0.2934 -0.4662 -0.4452 0.1131 0.0595 -0.1109 -0.2860 -0.2642 -0.3513 0.3865 0.0044 0.2446 -0.2225 -0.2929 -0.1325 -0.0230 -0.0880 0.2838 -0.2521 -0.1028 -0.4610 0.0464 0.1136 0.0955 0.1014 0.0977 0.0953 0.0940 0.0941 0.0868 0.1228 0.1035 0.1018 0.0996 0.0952 0.0848 0.0973 0.0957 0.1047 0.1022 0.1154 0.1010 0.1195 0.1329 0.1114 0.2875
va: 2.1289 2.0276 2.0625 3.7103 3.7241 3.9062 3.9048 3.9089 3.8953 4.1085 3.6873 3.7786 3.9242 3.9479 3.9041 3.7219 3.5195 4.0608 3.9371 3.8839 3.8314 3.5329 0.9993 1.0290 0.9995 1.0136 1.0013 1.0022 1.0021 1.0050 1.0210 1.0294 1.0287 1.0238 0.9935 1.0101 0.9929 1.0041 0.9946 0.9959 0.9985 1.0036 1.0081 0.9882 1.0214 0.9467
dispcorr: -0.021607000 hartree
energy: -964.191356524601
dipole: -25.04556 23.42699 -1.61856 4.93091 -4.68898 0.24194 -17.39843 16.05635 -1.34208
magnitude: 2.11648 au
magnitude: 5.37966 debye
