program: Orca
programVersion: 5.0.2
elementType: O O O C C C C C C C C C C C C C C C C C C C H H H H H H H H H H H H H H H H H H H H H H H H
charge: 0
multiplicity: 1
keywords: wb97x-d3
keywords: def2-TZVPP
keywords: def2/J RIJCOSX
keywords: DEFGRID2
keywords: scfconv7
keywords: smallprint printgap noloewdin
keywords: NOSOSCF
formula: C19H24O3
InChI: InChI=1/C19H24O3/c1-7-8-13-12(4)16(10-15(13)20)22-18(21)17-14(9-11(2)3)19(17,5)6/h1,9,14,16-17H,8,10H2,2-6H3
46 atoms
O  0.021235 -0.660498 1.025195
O  -1.307504 1.138498 0.963532
O  4.143323 -1.308807 2.922199
C  -3.513456 -0.84226 0.020241
C  -2.81619 -0.492876 -1.256739
C  -2.001417 -0.936576 -0.035836
C  -4.214875 0.215992 0.834827
C  -4.219871 -2.177145 0.065845
C  -2.749131 0.874542 -1.803918
C  -1.104596 -0.020144 0.688469
C  -2.89929 1.209166 -3.091431
C  1.034586 0.026193 1.762816
C  -2.806605 2.643559 -3.51957
C  -3.164122 0.252258 -4.214139
C  1.754083 -0.954369 2.679385
C  2.103911 0.556924 0.837114
C  3.321608 0.129731 1.201961
C  3.216201 -0.782953 2.345534
C  1.763555 1.457748 -0.289268
C  4.642054 0.469005 0.578853
C  4.940368 -0.37935 -0.568503
C  5.182851 -1.075814 -1.5175
H  -2.849485 -1.276213 -2.005157
H  -1.609065 -1.943841 -0.11067
H  -4.21072 -0.047456 1.894386
H  -3.790719 1.210911 0.740087
H  -5.258378 0.276078 0.519142
H  -5.237215 -2.087303 -0.320702
H  -3.70527 -2.932345 -0.529942
H  -4.285401 -2.550188 1.090141
H  -2.567821 1.68089 -1.10337
H  0.592473 0.850618 2.327131
H  1.456623 -1.985557 2.474942
H  1.570959 -0.766985 3.737918
H  -3.741382 2.979808 -3.976737
H  -2.580346 3.310183 -2.687288
H  -2.029566 2.776463 -4.277534
H  -2.34913 0.279273 -4.942572
H  -3.290996 -0.781874 -3.900641
H  -4.067916 0.54241 -4.756284
H  2.647349 1.80977 -0.817946
H  1.204895 2.325963 0.065166
H  1.126678 0.947682 -1.01605
H  4.659103 1.515245 0.26498
H  5.436188 0.3597 1.321864
H  5.386286 -1.698555 -2.359338
elementType: O C H
totalener: -964.17129884 hartree
nucrepener: 1762.84357949 hartree
electener: -2727.01487833 hartree
oneelecener: -4810.56616117 hartree
twoeener: 2083.55128284 hartree
cpcmener: -0.03160606 hartree
kineticenergy: 959.75938735 hartree
xcener: -94.694578751592 hartree
chargesum: -0.0000000
charge: -0.293678 -0.468070 -0.444371 0.105887 0.038111 -0.097815 -0.284318 -0.262347 -0.304822 0.388872 -0.047560 0.243429 -0.217159 -0.255895 -0.132839 -0.029332 -0.090215 0.288940 -0.243903 -0.117468 -0.448945 0.046756 0.115804 0.095097 0.101308 0.097091 0.095689 0.094385 0.086717 0.093900 0.121931 0.104681 0.101066 0.099828 0.093313 0.087976 0.091264 0.097488 0.088355 0.094915 0.102388 0.118325 0.111812 0.130796 0.116037 0.286577
qa: -0.2937 -0.4681 -0.4444 0.1059 0.0381 -0.0978 -0.2843 -0.2623 -0.3048 0.3889 -0.0476 0.2434 -0.2172 -0.2559 -0.1328 -0.0293 -0.0902 0.2889 -0.2439 -0.1175 -0.4489 0.0468 0.1158 0.0951 0.1013 0.0971 0.0957 0.0944 0.0867 0.0939 0.1219 0.1047 0.1011 0.0998 0.0933 0.0880 0.0913 0.0975 0.0884 0.0949 0.1024 0.1183 0.1118 0.1308 0.1160 0.2866
va: 2.1289 2.0259 2.0624 3.7107 3.7361 3.8810 3.9050 3.9078 3.8551 4.1044 3.7808 3.7779 3.9225 3.9396 3.8988 3.7451 3.5145 4.0710 3.9390 3.8861 3.8365 3.5391 1.0027 1.0295 0.9990 1.0135 1.0014 1.0020 1.0053 1.0022 1.0223 1.0287 1.0294 1.0236 0.9965 1.0089 0.9962 0.9966 1.0133 0.9973 1.0049 1.0052 1.0000 0.9899 1.0141 0.9472
dispcorr: -0.021294284 hartree
energy: -964.192593120396
dipole: -25.72208 24.05380 -1.66828 4.96464 -4.63166 0.33298 -16.90595 15.60309 -1.30286
magnitude: 2.14278 au
magnitude: 5.44651 debye
