program: Orca
programVersion: 5.0.2
elementType: O O O C C C C C C C C C C C C C C C C C C C H H H H H H H H H H H H H H H H H H H H H H H H
charge: 0
multiplicity: 1
keywords: wb97x-d3
keywords: def2-TZVPP
keywords: def2/J RIJCOSX
keywords: DEFGRID2
keywords: scfconv7
keywords: smallprint printgap noloewdin
keywords: NOSOSCF
formula: C19H24O3
InChI: InChI=1/C19H24O3/c1-7-8-13-12(4)16(10-15(13)20)22-18(21)17-14(9-11(2)3)19(17,5)6/h1,9,14,16-17H,8,10H2,2-6H3
46 atoms
O  -0.630397 -0.000699 1.08041
O  -1.784955 -1.552277 2.183824
O  3.228563 -2.116695 0.113311
C  -3.258098 0.95978 -0.122813
C  -2.678008 -0.051102 -1.051043
C  -2.863061 -0.396804 0.433106
C  -2.506739 2.219164 0.231761
C  -4.751553 1.182668 -0.196626
C  -1.344993 0.112174 -1.68513
C  -1.731241 -0.702262 1.32266
C  -0.612984 -0.88203 -2.193741
C  0.569916 -0.370812 1.76502
C  0.699727 -0.618213 -2.865761
C  -1.024313 -2.320785 -2.13237
C  1.147591 -1.702179 1.293055
C  1.593856 0.661878 1.371534
C  2.637779 0.112618 0.736197
C  2.455798 -1.339019 0.630145
C  1.377942 2.098414 1.665883
C  3.830015 0.821864 0.169003
C  3.461222 1.711467 -0.925295
C  3.131829 2.449511 -1.815445
H  -3.403151 -0.573262 -1.669798
H  -3.698731 -1.05386 0.644779
H  -2.78759 3.014539 -0.46183
H  -2.772817 2.555525 1.235804
H  -1.425652 2.124364 0.191653
H  -5.142158 1.544582 0.756659
H  -4.99051 1.928291 -0.957742
H  -5.289609 0.268125 -0.449987
H  -0.959448 1.124108 -1.767819
H  0.400457 -0.350203 2.845187
H  0.50377 -2.224524 0.582665
H  1.330106 -2.388369 2.12174
H  0.937567 0.445096 -2.90422
H  1.516892 -1.127383 -2.346905
H  0.702725 -1.000923 -3.890201
H  -1.870558 -2.497715 -1.469958
H  -1.296221 -2.691408 -3.125041
H  -0.195664 -2.945964 -1.790539
H  0.845065 2.232833 2.607878
H  0.771053 2.562549 0.884203
H  2.316025 2.650225 1.716269
H  4.332143 1.402309 0.948411
H  4.559921 0.09059 -0.185976
H  2.845474 3.110761 -2.601957
elementType: O C H
totalener: -964.16685829 hartree
nucrepener: 1896.83536425 hartree
electener: -2861.00222254 hartree
oneelecener: -5078.48110826 hartree
twoeener: 2217.47888572 hartree
cpcmener: -0.03285148 hartree
kineticenergy: 959.77347719 hartree
xcener: -94.697237033176 hartree
chargesum: -0.0000000
charge: -0.261245 -0.469719 -0.447725 0.146420 -0.024292 -0.136738 -0.273563 -0.269310 -0.230320 0.391875 -0.040198 0.221327 -0.230789 -0.280941 -0.132008 -0.016241 -0.083109 0.269112 -0.300147 -0.075571 -0.444941 0.010194 0.112712 0.092415 0.100318 0.104189 0.061822 0.095884 0.093907 0.086782 0.120504 0.110676 0.104648 0.116378 0.082469 0.087227 0.108711 0.096190 0.114794 0.092869 0.119986 0.124912 0.117461 0.134761 0.111215 0.287098
qa: -0.2612 -0.4697 -0.4477 0.1464 -0.0243 -0.1367 -0.2736 -0.2693 -0.2303 0.3919 -0.0402 0.2213 -0.2308 -0.2809 -0.1320 -0.0162 -0.0831 0.2691 -0.3001 -0.0756 -0.4449 0.0102 0.1127 0.0924 0.1003 0.1042 0.0618 0.0959 0.0939 0.0868 0.1205 0.1107 0.1046 0.1164 0.0825 0.0872 0.1087 0.0962 0.1148 0.0929 0.1200 0.1249 0.1175 0.1348 0.1112 0.2871
va: 2.1038 2.0374 2.0469 3.7407 3.7891 3.8746 3.9058 3.9045 3.8149 4.1419 3.6948 3.7863 3.9216 3.9426 3.8814 3.7253 3.5036 4.0220 3.9487 3.8586 3.8188 3.5788 1.0030 1.0278 1.0009 1.0013 1.0108 1.0018 1.0020 1.0054 1.0002 1.0144 1.0205 1.0187 1.0088 1.0021 0.9998 1.0035 0.9986 0.9985 1.0028 0.9858 0.9975 0.9894 1.0226 0.9480
dispcorr: -0.027560726 hartree
energy: -964.194419016859
dipole: -12.10116 11.25192 -0.84924 7.86779 -5.80410 2.06368 -8.80564 8.90094 0.09530
magnitude: 2.23362 au
magnitude: 5.67742 debye
