program: Orca
programVersion: 5.0.2
elementType: O O O C C C C C C C C C C C C C C C C C C C H H H H H H H H H H H H H H H H H H H H H H H H
charge: 0
multiplicity: 1
keywords: wb97x-d3
keywords: def2-TZVPP
keywords: def2/J RIJCOSX
keywords: DEFGRID2
keywords: scfconv7
keywords: smallprint printgap noloewdin
keywords: NOSOSCF
formula: C19H24O3
InChI: InChI=1/C19H24O3/c1-7-8-13-12(4)16(10-15(13)20)22-18(21)17-14(9-11(2)3)19(17,5)6/h1,9,14,16-17H,8,10H2,2-6H3
46 atoms
O  -0.47199 -0.30544 0.792179
O  -1.491874 -0.732743 2.728402
O  3.807394 -1.737296 1.912022
C  -3.425516 0.227543 -0.080067
C  -2.882123 -0.992884 -0.758807
C  -2.769921 -0.866814 0.745778
C  -2.744632 1.563731 -0.245516
C  -4.924065 0.343981 0.066863
C  -1.719734 -0.995071 -1.685887
C  -1.535856 -0.635145 1.531438
C  -1.703152 -0.423376 -2.890725
C  0.729083 0.030172 1.481346
C  -0.502624 -0.53561 -3.78247
C  -2.849893 0.349947 -3.466774
C  1.455371 -1.151324 2.116388
C  1.690866 0.579549 0.458607
C  2.895491 0.005674 0.556949
C  2.871299 -1.056917 1.580106
C  1.262892 1.644566 -0.483473
C  4.143508 0.316276 -0.215169
C  4.588461 1.694713 -0.055839
C  4.947804 2.831886 0.075293
H  -3.64454 -1.717991 -1.038538
H  -3.465044 -1.468801 1.31982
H  -1.691536 1.480321 -0.496528
H  -3.225294 2.126742 -1.047253
H  -2.836187 2.156305 0.666943
H  -5.187375 0.951393 0.934357
H  -5.361583 0.818609 -0.814391
H  -5.399966 -0.629885 0.186835
H  -0.847367 -1.560139 -1.379778
H  0.507086 0.800993 2.227785
H  1.020534 -2.102974 1.803101
H  1.438152 -1.137843 3.204933
H  -0.122888 0.451696 -4.058307
H  0.308975 -1.087829 -3.310059
H  -0.753335 -1.042284 -4.717669
H  -3.72699 0.354739 -2.823232
H  -2.565329 1.387561 -3.659013
H  -3.147624 -0.071178 -4.430214
H  2.104936 2.10026 -0.999421
H  0.718513 2.433671 0.038718
H  0.579907 1.23095 -1.229991
H  4.935678 -0.358572 0.118813
H  3.992689 0.107197 -1.278437
H  5.276401 3.835005 0.201696
totalener: -964.14241074 hartree
nucrepener: 1831.23988784 hartree
electener: -2795.38229858 hartree
oneelecener: -4946.74439974 hartree
twoeener: 2151.36210115 hartree
kineticenergy: 959.82841326 hartree
xcener: -94.700535237180 hartree
chargesum: -0.0000000
charge: -0.278253 -0.354319 -0.329073 0.042617 0.015630 -0.063567 -0.265232 -0.246079 -0.215361 0.307793 -0.015889 0.189972 -0.228933 -0.252378 -0.146809 0.005288 -0.072145 0.239174 -0.289252 -0.156364 -0.422380 0.099248 0.103768 0.088509 0.080538 0.086735 0.112479 0.097795 0.080880 0.074896 0.084667 0.096772 0.087336 0.102443 0.084159 0.082715 0.099366 0.083347 0.091626 0.098459 0.109353 0.102451 0.103448 0.119375 0.119721 0.245473
qa: -0.2783 -0.3543 -0.3291 0.0426 0.0156 -0.0636 -0.2652 -0.2461 -0.2154 0.3078 -0.0159 0.1900 -0.2289 -0.2524 -0.1468 0.0053 -0.0721 0.2392 -0.2893 -0.1564 -0.4224 0.0992 0.1038 0.0885 0.0805 0.0867 0.1125 0.0978 0.0809 0.0749 0.0847 0.0968 0.0873 0.1024 0.0842 0.0827 0.0994 0.0833 0.0916 0.0985 0.1094 0.1025 0.1034 0.1194 0.1197 0.2455
va: 2.0900 2.1551 2.1744 3.7648 3.7425 3.8610 3.9058 3.9189 3.8814 4.2401 3.7118 3.7941 3.9303 3.9410 3.8914 3.6101 3.5165 4.0850 3.9572 3.9023 3.8711 3.5648 1.0069 1.0287 1.0034 1.0056 1.0035 1.0031 1.0055 1.0093 1.0330 1.0159 1.0268 1.0288 0.9966 1.0087 1.0015 1.0094 0.9978 1.0048 1.0181 1.0015 0.9929 1.0198 0.9851 0.9728
dispcorr: -0.025336981 hartree
energy: -964.167747725683
dipole: -19.95286 18.68040 -1.27246 8.46227 -7.47350 0.98877 -19.63967 18.07568 -1.56399
magnitude: 2.24564 au
magnitude: 5.70796 debye
