program: Orca
programVersion: 5.0.2
elementType: O O O C C C C C C C C C C C C C C C C C C C H H H H H H H H H H H H H H H H H H H H H H H H
charge: 0
multiplicity: 1
keywords: wb97x-d3
keywords: def2-TZVPP
keywords: def2/J RIJCOSX
keywords: DEFGRID2
keywords: scfconv7
keywords: smallprint printgap noloewdin
keywords: NOSOSCF
formula: C19H24O3
InChI: InChI=1/C19H24O3/c1-7-8-13-12(4)16(10-15(13)20)22-18(21)17-14(9-11(2)3)19(17,5)6/h1,9,14,16-17H,8,10H2,2-6H3
46 atoms
O  -0.140746 -0.74621 0.956591
O  -1.399952 1.110293 0.928619
O  4.009074 -1.380632 2.890051
C  -3.713987 -0.771782 0.07849
C  -3.0571 -0.338008 -1.186046
C  -2.210894 -0.920525 -0.048927
C  -4.324798 0.234897 1.022493
C  -4.479582 -2.074762 0.042304
C  -2.952764 1.081918 -1.596588
C  -1.252911 -0.052147 0.659529
C  -2.152318 1.53687 -2.561081
C  0.924849 -0.081618 1.630797
C  -2.150317 2.982496 -2.954111
C  -1.196445 0.669584 -3.322455
C  1.618857 -1.034982 2.595615
C  2.000644 0.336921 0.657355
C  3.207806 -0.095066 1.041742
C  3.094902 -0.905961 2.266622
C  1.670046 1.14973 -0.539505
C  4.533684 0.158397 0.388367
C  4.620936 -0.402348 -0.95363
C  4.68259 -0.860548 -2.060902
H  -3.158379 -1.034478 -2.013721
H  -1.853431 -1.931964 -0.202925
H  -3.785251 1.175397 1.070948
H  -5.350995 0.445668 0.715494
H  -4.364239 -0.172908 2.033942
H  -5.510845 -1.904143 -0.27167
H  -4.038945 -2.791603 -0.651795
H  -4.504266 -2.540625 1.028847
H  -3.596424 1.791487 -1.089104
H  0.536378 0.801953 2.144548
H  1.304112 -2.065501 2.418536
H  1.428728 -0.81281 3.645646
H  -2.385339 3.103626 -4.014662
H  -2.872576 3.563048 -2.382112
H  -1.164527 3.428734 -2.800279
H  -1.470649 0.617616 -4.379396
H  -0.187924 1.089551 -3.288996
H  -1.14166 -0.348107 -2.940015
H  1.124213 0.543033 -1.265832
H  2.560125 1.527428 -1.038013
H  1.02164 1.987136 -0.279118
H  4.732611 1.233346 0.342739
H  5.320413 -0.271352 1.013359
H  4.744483 -1.276349 -3.037288
totalener: -964.14632675 hartree
nucrepener: 1800.87813536 hartree
electener: -2765.02446212 hartree
oneelecener: -4886.41031815 hartree
twoeener: 2121.38585604 hartree
kineticenergy: 959.82553209 hartree
xcener: -94.699674801114 hartree
chargesum: 0.0000000
charge: -0.278865 -0.385690 -0.330172 0.129497 -0.059759 -0.086342 -0.284452 -0.239170 -0.139152 0.321090 -0.019975 0.212525 -0.207546 -0.289493 -0.132074 -0.024414 -0.061865 0.218047 -0.268538 -0.162071 -0.413811 0.091399 0.094472 0.083020 0.102621 0.092428 0.087527 0.089156 0.071767 0.091562 0.084705 0.097642 0.090890 0.087350 0.084936 0.079935 0.082348 0.106633 0.080923 0.089025 0.107667 0.099244 0.123481 0.119093 0.119735 0.244672
qa: -0.2789 -0.3857 -0.3302 0.1295 -0.0598 -0.0863 -0.2845 -0.2392 -0.1392 0.3211 -0.0200 0.2125 -0.2075 -0.2895 -0.1321 -0.0244 -0.0619 0.2180 -0.2685 -0.1621 -0.4138 0.0914 0.0945 0.0830 0.1026 0.0924 0.0875 0.0892 0.0718 0.0916 0.0847 0.0976 0.0909 0.0873 0.0849 0.0799 0.0823 0.1066 0.0809 0.0890 0.1077 0.0992 0.1235 0.1191 0.1197 0.2447
va: 2.1175 2.0956 2.1730 3.7616 3.8657 3.8407 3.9128 3.8978 3.8742 4.1695 3.7299 3.8093 3.9437 3.9526 3.8729 3.6798 3.4930 4.1134 3.9504 3.9158 3.8661 3.5758 1.0026 1.0320 1.0207 0.9981 1.0041 1.0047 1.0072 1.0049 1.0134 1.0298 1.0315 1.0282 0.9975 1.0117 0.9992 1.0019 0.9987 1.0039 0.9981 1.0054 1.0084 0.9852 1.0196 0.9734
dispcorr: -0.023101482 hartree
energy: -964.169428236230
dipole: -21.40683 20.25557 -1.15126 5.96466 -5.73725 0.22740 -14.44611 13.48956 -0.95655
magnitude: 1.51397 au
magnitude: 3.84820 debye
