program: Orca
programVersion: 5.0.2
elementType: O O O C C C C C C C C C C C C C C C C C C C H H H H H H H H H H H H H H H H H H H H H H H H
charge: 0
multiplicity: 1
keywords: wb97x-d3
keywords: def2-TZVPP
keywords: def2/J RIJCOSX
keywords: DEFGRID2
keywords: scfconv7
keywords: smallprint printgap noloewdin
keywords: NOSOSCF
formula: C19H24O3
InChI: InChI=1/C19H24O3/c1-7-8-13-12(4)16(10-15(13)20)22-18(21)17-14(9-11(2)3)19(17,5)6/h1,9,14,16-17H,8,10H2,2-6H3
46 atoms
O  -0.38876 -0.843104 1.108895
O  -1.474874 1.065858 1.536517
O  3.673102 -2.491651 1.551111
C  -3.855889 -0.061996 -0.051689
C  -2.834373 -0.142966 -1.140258
C  -2.521623 -0.684688 0.256958
C  -4.274057 1.272267 0.518711
C  -5.005773 -1.040886 -0.134723
C  -2.125778 1.0438 -1.67972
C  -1.450326 -0.027169 1.039387
C  -0.961392 0.989241 -2.330773
C  0.752405 -0.43816 1.869902
C  -0.340135 2.217301 -2.924257
C  -0.188326 -0.277943 -2.533069
C  1.503292 -1.692253 2.301031
C  1.734728 0.326983 1.006075
C  2.862618 -0.368312 0.81201
C  2.812614 -1.64981 1.538005
C  1.422333 1.685264 0.496196
C  4.073558 0.020753 0.015853
C  3.782388 0.351981 -1.372587
C  3.546785 0.634355 -2.515115
H  -2.997843 -0.932829 -1.868422
H  -2.498297 -1.767026 0.326263
H  -5.107356 1.666547 -0.065739
H  -4.618706 1.156014 1.54705
H  -3.483848 2.015242 0.528509
H  -5.802808 -0.644602 -0.766229
H  -4.700165 -2.000444 -0.55445
H  -5.427419 -1.231606 0.853649
H  -2.610653 2.007786 -1.566053
H  0.428253 0.171126 2.717344
H  0.951648 -2.607271 2.085002
H  1.715677 -1.691247 3.371923
H  -0.279087 2.133792 -4.012546
H  -0.90554 3.118358 -2.690142
H  0.683456 2.355199 -2.566462
H  0.833198 -0.171381 -2.159304
H  -0.631611 -1.135704 -2.032404
H  -0.103831 -0.513785 -3.597392
H  1.072809 2.324584 1.307599
H  0.61234 1.656134 -0.23416
H  2.283741 2.150148 0.022455
H  4.574396 0.871568 0.488472
H  4.788779 -0.805032 0.04619
H  3.34683 0.874797 -3.531217
totalener: -964.14425064 hartree
nucrepener: 1861.52627681 hartree
electener: -2825.67052745 hartree
oneelecener: -5007.75968305 hartree
twoeener: 2182.08915560 hartree
kineticenergy: 959.82837858 hartree
xcener: -94.701596576703 hartree
chargesum: 0.0000000
charge: -0.257003 -0.373381 -0.330842 0.135372 -0.055706 -0.100684 -0.262384 -0.247944 -0.155365 0.316289 -0.055594 0.202472 -0.211038 -0.227185 -0.133082 -0.054246 -0.072971 0.219289 -0.216683 -0.152038 -0.378248 0.049548 0.091163 0.083231 0.087158 0.089272 0.091937 0.089462 0.070305 0.091682 0.090126 0.094186 0.091752 0.090080 0.094725 0.085921 0.071566 0.065762 0.088475 0.099389 0.118912 0.088244 0.099156 0.119706 0.120702 0.248512
qa: -0.2570 -0.3734 -0.3308 0.1354 -0.0557 -0.1007 -0.2624 -0.2479 -0.1554 0.3163 -0.0556 0.2025 -0.2110 -0.2272 -0.1331 -0.0542 -0.0730 0.2193 -0.2167 -0.1520 -0.3782 0.0495 0.0912 0.0832 0.0872 0.0893 0.0919 0.0895 0.0703 0.0917 0.0901 0.0942 0.0918 0.0901 0.0947 0.0859 0.0716 0.0658 0.0885 0.0994 0.1189 0.0882 0.0992 0.1197 0.1207 0.2485
va: 2.1107 2.1140 2.1722 3.7762 3.8761 3.8279 3.9126 3.9048 3.8417 4.2039 3.7564 3.8111 3.9257 3.9406 3.8685 3.6470 3.4872 4.1186 3.9568 3.8963 3.8497 3.6201 1.0062 1.0292 0.9981 1.0064 1.0200 1.0050 1.0068 1.0048 1.0136 1.0235 1.0352 1.0231 0.9973 1.0121 1.0037 1.0135 1.0172 1.0034 1.0132 1.0086 0.9985 0.9850 1.0192 0.9730
dispcorr: -0.026447643 hartree
energy: -964.170698284179
dipole: -16.60258 15.76755 -0.83503 8.50882 -7.98375 0.52507 -11.27674 10.97972 -0.29702
magnitude: 1.03015 au
magnitude: 2.61842 debye
