program: Orca
programVersion: 5.0.2
elementType: O O O C C C C C C C C C C C C C C C C C C C H H H H H H H H H H H H H H H H H H H H H H H H
charge: 0
multiplicity: 1
keywords: wb97x-d3
keywords: def2-TZVPP
keywords: def2/J RIJCOSX
keywords: DEFGRID2
keywords: scfconv7
keywords: smallprint printgap noloewdin
keywords: NOSOSCF
formula: C19H24O3
InChI: InChI=1/C19H24O3/c1-7-8-13-12(4)16(10-15(13)20)22-18(21)17-14(9-11(2)3)19(17,5)6/h1,9,14,16-17H,8,10H2,2-6H3
46 atoms
O  -0.503969 -0.221563 0.381814
O  -1.378357 -0.423295 2.432613
O  3.682531 -0.871289 -1.283719
C  -3.157446 1.039546 -0.414815
C  -3.190842 -0.397739 -0.811975
C  -2.837256 -0.019602 0.624176
C  -2.093117 1.966174 -0.952204
C  -4.483764 1.7382 -0.218508
C  -2.231858 -0.992381 -1.777992
C  -1.51689 -0.238892 1.251979
C  -1.903821 -2.283086 -1.836817
C  0.819429 -0.493999 0.835321
C  -0.982964 -2.806687 -2.897099
C  -2.400004 -3.303136 -0.858519
C  1.556417 -1.333952 -0.200998
C  1.612341 0.786357 0.940776
C  2.730717 0.738116 0.206479
C  2.80044 -0.533904 -0.536706
C  1.131794 1.897572 1.799616
C  3.807996 1.774885 0.076964
C  4.445956 2.101083 1.345715
C  4.96146 2.372152 2.394677
H  -4.189958 -0.822133 -0.878644
H  -3.622992 -0.186891 1.35191
H  -1.893693 2.769861 -0.240589
H  -1.150109 1.475588 -1.172693
H  -2.447634 2.431547 -1.873815
H  -5.249477 1.062505 0.164351
H  -4.390081 2.565682 0.486745
H  -4.846527 2.145416 -1.164048
H  -1.808929 -0.321674 -2.519666
H  0.77795 -0.983806 1.811471
H  0.95067 -1.474149 -1.098288
H  1.82843 -2.325267 0.163667
H  -0.638906 -2.019979 -3.567491
H  -0.102674 -3.283653 -2.457529
H  -1.474936 -3.571208 -3.50349
H  -2.962083 -4.091667 -1.365113
H  -1.560676 -3.795221 -0.360081
H  -3.038727 -2.879345 -0.086262
H  1.875613 2.682759 1.9148
H  0.86094 1.530605 2.790743
H  0.228867 2.343079 1.375109
H  4.563178 1.405877 -0.621582
H  3.402245 2.688531 -0.367591
H  5.425757 2.603334 3.322681
totalener: -964.14240761 hartree
nucrepener: 1843.12913901 hartree
electener: -2807.27154662 hartree
oneelecener: -4970.67201079 hartree
twoeener: 2163.40046417 hartree
kineticenergy: 959.82930718 hartree
xcener: -94.701234170917 hartree
chargesum: -0.0000000
charge: -0.254730 -0.364336 -0.330331 0.140433 -0.042177 -0.143140 -0.314085 -0.244545 -0.159487 0.345907 -0.057276 0.169947 -0.223473 -0.248388 -0.124392 -0.042970 -0.062274 0.225553 -0.234200 -0.160002 -0.423488 0.103494 0.100808 0.091153 0.093055 0.092908 0.100080 0.072933 0.092817 0.087380 0.092053 0.107202 0.079670 0.093865 0.089351 0.080447 0.100224 0.098187 0.086631 0.087997 0.097243 0.116153 0.099373 0.119074 0.119687 0.245667
qa: -0.2547 -0.3643 -0.3303 0.1404 -0.0422 -0.1431 -0.3141 -0.2445 -0.1595 0.3459 -0.0573 0.1699 -0.2235 -0.2484 -0.1244 -0.0430 -0.0623 0.2256 -0.2342 -0.1600 -0.4235 0.1035 0.1008 0.0912 0.0931 0.0929 0.1001 0.0729 0.0928 0.0874 0.0921 0.1072 0.0797 0.0939 0.0894 0.0804 0.1002 0.0982 0.0866 0.0880 0.0972 0.1162 0.0994 0.1191 0.1197 0.2457
va: 2.0651 2.1391 2.1766 3.7033 3.8220 3.8535 3.9164 3.9118 3.8381 4.2078 3.7427 3.7901 3.9266 3.9500 3.8518 3.6768 3.4849 4.1401 3.9443 3.9051 3.8668 3.5609 1.0067 1.0272 1.0010 1.0120 1.0035 1.0088 1.0035 1.0043 1.0080 1.0319 1.0443 1.0256 1.0075 0.9982 1.0003 1.0014 1.0003 1.0079 1.0119 1.0089 1.0015 1.0190 0.9854 0.9726
dispcorr: -0.025160033 hartree
energy: -964.167567641336
dipole: -18.08321 16.85931 -1.22390 -0.05775 0.53472 0.47697 -7.69713 7.50175 -0.19538
magnitude: 1.32801 au
magnitude: 3.37554 debye
