program: Orca
programVersion: 5.0.2
elementType: O O O C C C C C C C C C C C C C C C C C C C H H H H H H H H H H H H H H H H H H H H H H H H
charge: 0
multiplicity: 1
keywords: wb97x-d3
keywords: def2-TZVPP
keywords: def2/J RIJCOSX
keywords: DEFGRID2
keywords: scfconv7
keywords: smallprint printgap noloewdin
keywords: NOSOSCF
formula: C19H24O3
InChI: InChI=1/C19H24O3/c1-7-8-13-12(4)16(10-15(13)20)22-18(21)17-14(9-11(2)3)19(17,5)6/h1,9,14,16-17H,8,10H2,2-6H3
46 atoms
O  -0.640099 0.188361 0.932784
O  -1.545646 -1.193156 2.431547
O  3.074859 -1.815285 -0.515605
C  -3.420736 0.810207 -0.09651
C  -2.939556 -0.389147 -0.842164
C  -2.918843 -0.381491 0.691541
C  -2.672575 2.120284 -0.147537
C  -4.918365 1.012863 -0.029607
C  -1.703274 -0.386199 -1.661562
C  -1.659114 -0.501826 1.453859
C  -1.091587 -1.473855 -2.132592
C  0.658871 -0.060968 1.4663
C  0.12214 -1.366028 -3.00444
C  -1.539047 -2.871969 -1.832584
C  1.231079 -1.403231 1.017148
C  1.569211 0.977748 0.858989
C  2.529109 0.422625 0.111272
C  2.386112 -1.044929 0.104113
C  1.356904 2.419871 1.14197
C  3.625907 1.101583 -0.654029
C  4.475662 1.935868 0.184683
C  5.167158 2.624836 0.882468
H  -3.727411 -1.025922 -1.235045
H  -3.694989 -0.973102 1.163058
H  -2.840116 2.688624 0.769014
H  -1.600888 2.013468 -0.279551
H  -3.049756 2.720912 -0.97738
H  -5.198208 1.581086 0.85914
H  -5.269467 1.564557 -0.903551
H  -5.458515 0.065859 -0.000176
H  -1.289929 0.581464 -1.924614
H  0.631878 0.031514 2.556123
H  0.502852 -2.019559 0.488921
H  1.59561 -1.996088 1.857287
H  0.406697 -0.329332 -3.181369
H  0.978049 -1.878644 -2.559027
H  -0.049878 -1.835867 -3.976277
H  -2.371722 -2.915611 -1.133263
H  -1.837238 -3.391353 -2.746933
H  -0.718293 -3.454231 -1.405583
H  1.663786 2.646885 2.166035
H  0.303264 2.687816 1.058628
H  1.934692 3.062273 0.481223
H  4.234848 0.336345 -1.142149
H  3.202882 1.710708 -1.458885
H  5.790974 3.230669 1.493836
totalener: -964.14281968 hartree
nucrepener: 1868.38586918 hartree
electener: -2832.52868886 hartree
oneelecener: -5021.25924151 hartree
twoeener: 2188.73055266 hartree
kineticenergy: 959.83173847 hartree
xcener: -94.700834582658 hartree
chargesum: -0.0000000
charge: -0.270222 -0.356971 -0.335962 0.151591 -0.051692 -0.112166 -0.280077 -0.247314 -0.149276 0.313991 -0.071581 0.219168 -0.219727 -0.246188 -0.120213 -0.045878 -0.037078 0.195778 -0.253713 -0.165311 -0.420681 0.103865 0.093587 0.086992 0.099331 0.066437 0.096136 0.092670 0.088439 0.073490 0.086832 0.098086 0.083795 0.101683 0.075152 0.091417 0.097336 0.087085 0.101064 0.088695 0.109760 0.103647 0.093780 0.120889 0.118185 0.245167
qa: -0.2702 -0.3570 -0.3360 0.1516 -0.0517 -0.1122 -0.2801 -0.2473 -0.1493 0.3140 -0.0716 0.2192 -0.2197 -0.2462 -0.1202 -0.0459 -0.0371 0.1958 -0.2537 -0.1653 -0.4207 0.1039 0.0936 0.0870 0.0993 0.0664 0.0961 0.0927 0.0884 0.0735 0.0868 0.0981 0.0838 0.1017 0.0752 0.0914 0.0973 0.0871 0.1011 0.0887 0.1098 0.1036 0.0938 0.1209 0.1182 0.2452
va: 2.0769 2.1507 2.1530 3.7179 3.8167 3.8570 3.9151 3.9105 3.8271 4.2406 3.7602 3.7715 3.9298 3.9402 3.8819 3.6929 3.4835 4.0667 3.9561 3.9120 3.8779 3.5636 1.0054 1.0279 1.0011 1.0139 1.0028 1.0039 1.0042 1.0080 1.0099 1.0187 1.0313 1.0248 1.0101 1.0075 1.0007 1.0072 1.0002 1.0007 0.9986 1.0063 1.0045 1.0193 0.9862 0.9729
dispcorr: -0.026114894 hartree
energy: -964.168934570734
dipole: -14.96844 14.11794 -0.85050 4.54864 -3.29888 1.24976 -9.78694 9.49688 -0.29006
magnitude: 1.53928 au
magnitude: 3.91254 debye
