program: Orca
programVersion: 5.0.2
elementType: O O O C C C C C C C C C C C C C C C C C C C H H H H H H H H H H H H H H H H H H H H H H H H
charge: 0
multiplicity: 1
keywords: wb97x-d3
keywords: def2-TZVPP
keywords: def2/J RIJCOSX
keywords: DEFGRID2
keywords: scfconv7
keywords: smallprint printgap noloewdin
keywords: NOSOSCF
formula: C19H24O3
InChI: InChI=1/C19H24O3/c1-7-8-13-12(4)16(10-15(13)20)22-18(21)17-14(9-11(2)3)19(17,5)6/h1,9,14,16-17H,8,10H2,2-6H3
46 atoms
O  -0.632028 0.188879 0.925702
O  -1.539143 -1.204123 2.412741
O  3.077504 -1.755606 -0.598722
C  -3.399927 0.826752 -0.112213
C  -2.945806 -0.392579 -0.842127
C  -2.916022 -0.361609 0.691406
C  -2.631152 2.123538 -0.190749
C  -4.893769 1.055254 -0.039677
C  -1.714312 -0.427671 -1.668194
C  -1.652966 -0.500457 1.444232
C  -1.129126 -1.536579 -2.123828
C  0.66735 -0.074129 1.451282
C  0.078041 -1.472354 -3.009058
C  -1.602247 -2.918913 -1.791311
C  1.241647 -1.399582 0.95766
C  1.5759 0.985863 0.879976
C  2.535781 0.457875 0.112755
C  2.392405 -1.00848 0.052669
C  1.359619 2.416737 1.212625
C  3.630833 1.163752 -0.630019
C  4.480113 1.972005 0.234443
C  5.172454 2.641815 0.949971
H  -3.747507 -1.020387 -1.221062
H  -3.700187 -0.932468 1.175073
H  -3.008945 2.717588 -1.025122
H  -2.779098 2.708318 0.718855
H  -1.562868 1.998221 -0.333775
H  -5.242187 1.594718 -0.92225
H  -5.448864 0.11792 0.012766
H  -5.1580 1.645744 0.839293
H  -1.283299 0.5266 -1.951565
H  0.639704 -0.018194 2.543486
H  0.512483 -2.001155 0.414072
H  1.612822 -2.016497 1.777486
H  -0.113567 -1.96228 -3.967185
H  0.380272 -0.445953 -3.214372
H  0.929302 -1.989898 -2.560345
H  -2.425531 -2.931361 -1.079876
H  -1.923868 -3.448732 -2.69139
H  -0.788564 -3.510819 -1.36409
H  0.306252 2.68586 1.126254
H  1.94452 3.083057 0.582243
H  1.653599 2.606268 2.248301
H  4.240983 0.416479 -1.143937
H  3.205917 1.798526 -1.41383
H  5.793103 3.226769 1.584871
totalener: -964.14298924 hartree
nucrepener: 1866.82626495 hartree
electener: -2830.96925419 hartree
oneelecener: -5018.14826547 hartree
twoeener: 2187.17901128 hartree
kineticenergy: 959.83126587 hartree
xcener: -94.700698531480 hartree
chargesum: -0.0000000
charge: -0.271321 -0.357337 -0.336944 0.154024 -0.052165 -0.112981 -0.281013 -0.247592 -0.152013 0.315891 -0.074693 0.220580 -0.216198 -0.244279 -0.120132 -0.049749 -0.035448 0.199105 -0.251253 -0.165875 -0.421439 0.103912 0.093463 0.086758 0.096109 0.098962 0.067354 0.088569 0.073370 0.092527 0.087301 0.098302 0.082799 0.101853 0.096881 0.075318 0.090650 0.087173 0.100907 0.088502 0.102871 0.093403 0.109256 0.121129 0.118281 0.245178
qa: -0.2713 -0.3573 -0.3369 0.1540 -0.0522 -0.1130 -0.2810 -0.2476 -0.1520 0.3159 -0.0747 0.2206 -0.2162 -0.2443 -0.1201 -0.0497 -0.0354 0.1991 -0.2513 -0.1659 -0.4214 0.1039 0.0935 0.0868 0.0961 0.0990 0.0674 0.0886 0.0734 0.0925 0.0873 0.0983 0.0828 0.1019 0.0969 0.0753 0.0906 0.0872 0.1009 0.0885 0.1029 0.0934 0.1093 0.1211 0.1183 0.2452
va: 2.0768 2.1498 2.1524 3.7122 3.8179 3.8559 3.9147 3.9105 3.8266 4.2397 3.7625 3.7669 3.9293 3.9389 3.8852 3.6940 3.4875 4.0673 3.9558 3.9100 3.8755 3.5639 1.0054 1.0280 1.0030 1.0008 1.0134 1.0042 1.0080 1.0040 1.0101 1.0195 1.0316 1.0249 1.0003 1.0103 1.0077 1.0075 0.9999 1.0007 1.0067 1.0048 0.9989 1.0190 0.9862 0.9728
dispcorr: -0.026025576 hartree
energy: -964.169014818355
dipole: -15.06817 14.21730 -0.85087 4.26651 -3.04017 1.22634 -9.57756 9.32741 -0.25015
magnitude: 1.51343 au
magnitude: 3.84682 debye
