program: Orca
programVersion: 5.0.2
elementType: O O O C C C C C C C C C C C C C C C C C C C H H H H H H H H H H H H H H H H H H H H H H H H
charge: 0
multiplicity: 1
keywords: wb97x-d3
keywords: def2-TZVPP
keywords: def2/J RIJCOSX
keywords: DEFGRID2
keywords: scfconv7
keywords: smallprint printgap noloewdin
keywords: NOSOSCF
formula: C19H24O3
InChI: InChI=1/C19H24O3/c1-7-8-13-12(4)16(10-15(13)20)22-18(21)17-14(9-11(2)3)19(17,5)6/h1,9,14,16-17H,8,10H2,2-6H3
46 atoms
O  0.125636 -0.66625 0.859757
O  -1.197251 1.134442 0.70878
O  4.049899 -1.063868 3.301602
C  -3.396773 -0.975055 0.005085
C  -2.85097 -0.550112 -1.322552
C  -1.894135 -0.974421 -0.20986
C  -4.059124 0.026213 0.918923
C  -4.030339 -2.344857 0.080469
C  -2.940375 0.832003 -1.828461
C  -0.995116 -0.030381 0.483087
C  -3.305834 1.191432 -3.062458
C  1.088513 0.037421 1.64095
C  -3.373681 2.64165 -3.441528
C  -3.67995 0.252021 -4.16986
C  1.706417 -0.8906 2.678595
C  2.250059 0.503077 0.796642
C  3.421913 0.136999 1.330903
C  3.200606 -0.664327 2.547628
C  2.024827 1.303795 -0.432318
C  4.802783 0.457598 0.841258
C  5.081622 -0.112602 -0.470278
C  5.296722 -0.57651 -1.555608
H  -2.920565 -1.312417 -2.090623
H  -1.452085 -1.954701 -0.344117
H  -4.005724 -0.311597 1.955458
H  -3.625286 1.01977 0.874284
H  -5.114414 0.111644 0.65466
H  -3.971562 -2.74834 1.093003
H  -5.084843 -2.293934 -0.196455
H  -3.547464 -3.058024 -0.589026
H  -2.696553 1.62346 -1.131554
H  0.613602 0.904086 2.109066
H  1.487416 -1.934389 2.443006
H  1.363504 -0.706425 3.696551
H  -3.088392 3.294678 -2.617792
H  -2.715432 2.859677 -4.286481
H  -4.383535 2.91861 -3.755324
H  -3.023722 0.393084 -5.03236
H  -3.639702 -0.799348 -3.893963
H  -4.695292 0.458338 -4.517953
H  1.574347 0.68526 -1.211629
H  2.950836 1.708351 -0.834903
H  1.330666 2.123204 -0.240935
H  4.947565 1.541328 0.800832
H  5.528644 0.079317 1.565308
H  5.493024 -0.995587 -2.51258
totalener: -964.14784996 hartree
nucrepener: 1754.87773050 hartree
electener: -2719.02558047 hartree
oneelecener: -4794.38130159 hartree
twoeener: 2075.35572112 hartree
kineticenergy: 959.81410622 hartree
xcener: -94.698615986596 hartree
chargesum: -0.0000000
charge: -0.279780 -0.403423 -0.329728 0.088482 0.036124 -0.101053 -0.258234 -0.239423 -0.224589 0.348862 -0.052201 0.224559 -0.204126 -0.241094 -0.130207 -0.048313 -0.058198 0.216586 -0.239957 -0.158834 -0.417635 0.095123 0.087897 0.082834 0.087526 0.102413 0.088475 0.088982 0.090417 0.071343 0.110008 0.093955 0.089632 0.087364 0.080868 0.082269 0.082792 0.087789 0.077127 0.086878 0.105209 0.093511 0.117947 0.118612 0.118460 0.244754
qa: -0.2798 -0.4034 -0.3297 0.0885 0.0361 -0.1011 -0.2582 -0.2394 -0.2246 0.3489 -0.0522 0.2246 -0.2041 -0.2411 -0.1302 -0.0483 -0.0582 0.2166 -0.2400 -0.1588 -0.4176 0.0951 0.0879 0.0828 0.0875 0.1024 0.0885 0.0890 0.0904 0.0713 0.1100 0.0940 0.0896 0.0874 0.0809 0.0823 0.0828 0.0878 0.0771 0.0869 0.1052 0.0935 0.1179 0.1186 0.1185 0.2448
va: 2.1245 2.0816 2.1726 3.7399 3.7794 3.8977 3.9240 3.9093 3.8973 4.1579 3.8128 3.7838 3.9384 3.9456 3.8735 3.7180 3.4834 4.1129 3.9495 3.9164 3.8626 3.5715 1.0100 1.0316 1.0018 1.0182 1.0028 1.0049 1.0036 1.0084 1.0263 1.0309 1.0313 1.0285 1.0125 0.9983 0.9982 0.9989 1.0167 0.9996 1.0024 1.0052 1.0092 0.9852 1.0199 0.9732
dispcorr: -0.021093528 hartree
energy: -964.168943491119
dipole: -26.77499 25.55748 -1.21752 3.57950 -3.51232 0.06718 -16.69599 15.65292 -1.04308
magnitude: 1.60464 au
magnitude: 4.07868 debye
