program: Orca
programVersion: 5.0.2
elementType: O O O C C C C C C C C C C C C C C C C C C C H H H H H H H H H H H H H H H H H H H H H H H H
charge: 0
multiplicity: 1
keywords: wb97x-d3
keywords: def2-TZVPP
keywords: def2/J RIJCOSX
keywords: DEFGRID2
keywords: scfconv7
keywords: smallprint printgap noloewdin
keywords: NOSOSCF
formula: C19H24O3
InChI: InChI=1/C19H24O3/c1-7-8-13-12(4)16(10-15(13)20)22-18(21)17-14(9-11(2)3)19(17,5)6/h1,9,14,16-17H,8,10H2,2-6H3
46 atoms
O  -0.178304 -0.756028 1.055152
O  -1.403957 1.121504 1.037448
O  4.020657 -1.487072 2.805326
C  -3.743271 -0.662748 0.079375
C  -2.997563 -0.300909 -1.159257
C  -2.246924 -0.889392 0.043045
C  -4.360197 0.39696 0.959024
C  -4.569885 -1.927884 0.027897
C  -2.788855 1.096546 -1.602394
C  -1.278129 -0.042368 0.76297
C  -1.97884 1.465095 -2.596222
C  0.906707 -0.106771 1.713806
C  -1.86782 2.898797 -3.017599
C  -1.120975 0.508225 -3.367705
C  1.628344 -1.090485 2.626329
C  1.951795 0.339982 0.718248
C  3.166354 -0.123342 1.037931
C  3.090447 -0.975284 2.237566
C  1.590603 1.211027 -0.428157
C  4.469326 0.135317 0.341658
C  4.495393 -0.376296 -1.022309
C  4.509252 -0.790885 -2.148234
H  -3.090442 -1.017036 -1.970346
H  -1.930121 -1.920122 -0.065513
H  -3.780257 1.31216 1.019013
H  -5.354821 0.645981 0.584403
H  -4.478894 0.018739 1.975716
H  -4.121393 -2.686494 -0.615005
H  -4.682702 -2.361577 1.023001
H  -5.568229 -1.716686 -0.359096
H  -3.355605 1.867592 -1.093657
H  0.533151 0.760049 2.26566
H  1.290056 -2.112689 2.445313
H  1.488919 -0.885912 3.68791
H  -2.12113 3.020653 -4.073844
H  -2.523512 3.547291 -2.438378
H  -0.844364 3.263462 -2.898536
H  -1.111266 -0.495868 -2.947783
H  -1.452418 0.435078 -4.406949
H  -0.086815 0.860093 -3.40105
H  0.964327 0.665569 -1.137708
H  2.467076 1.559955 -0.969792
H  1.007387 2.07064 -0.096258
H  4.683305 1.208252 0.327666
H  5.273252 -0.328649 0.918551
H  4.527511 -1.168391 -3.141728
totalener: -964.14650789 hartree
nucrepener: 1804.95856158 hartree
electener: -2769.10506947 hartree
oneelecener: -4894.56406769 hartree
twoeener: 2125.45899822 hartree
kineticenergy: 959.82444926 hartree
xcener: -94.699599255816 hartree
chargesum: -0.0000000
charge: -0.277413 -0.387041 -0.330157 0.131390 -0.065833 -0.072589 -0.280579 -0.239776 -0.127054 0.313590 -0.049452 0.211462 -0.206792 -0.278669 -0.132296 -0.032059 -0.062837 0.218738 -0.254674 -0.160418 -0.414137 0.091338 0.092282 0.081841 0.102290 0.092098 0.087118 0.071726 0.091441 0.089892 0.087007 0.097965 0.091517 0.087222 0.086273 0.080175 0.081490 0.088799 0.107056 0.081438 0.103075 0.098481 0.122932 0.119441 0.119279 0.244421
qa: -0.2774 -0.3870 -0.3302 0.1314 -0.0658 -0.0726 -0.2806 -0.2398 -0.1271 0.3136 -0.0495 0.2115 -0.2068 -0.2787 -0.1323 -0.0321 -0.0628 0.2187 -0.2547 -0.1604 -0.4141 0.0913 0.0923 0.0818 0.1023 0.0921 0.0871 0.0717 0.0914 0.0899 0.0870 0.0980 0.0915 0.0872 0.0863 0.0802 0.0815 0.0888 0.1071 0.0814 0.1031 0.0985 0.1229 0.1194 0.1193 0.2444
va: 2.1185 2.0937 2.1735 3.7687 3.8613 3.8502 3.9106 3.8975 3.8635 4.1723 3.7488 3.8097 3.9427 3.9475 3.8706 3.6912 3.4871 4.1132 3.9609 3.9140 3.8658 3.5753 1.0026 1.0318 1.0219 0.9983 1.0038 1.0071 1.0051 1.0047 1.0150 1.0286 1.0317 1.0281 0.9974 1.0119 0.9991 1.0047 1.0006 0.9986 0.9958 1.0048 1.0077 0.9851 1.0195 0.9736
dispcorr: -0.023212940 hartree
energy: -964.169720829213
dipole: -21.06634 19.90503 -1.16131 6.28286 -6.01407 0.26879 -14.74310 13.82512 -0.91798
magnitude: 1.50452 au
magnitude: 3.82418 debye
