program: Orca
programVersion: 5.0.2
elementType: O O O C C C C C C C C C C C C C C C C C C C H H H H H H H H H H H H H H H H H H H H H H H H
charge: 0
multiplicity: 1
keywords: wb97x-d3
keywords: def2-TZVPP
keywords: def2/J RIJCOSX
keywords: DEFGRID2
keywords: scfconv7
keywords: smallprint printgap noloewdin
keywords: NOSOSCF
formula: C19H24O3
InChI: InChI=1/C19H24O3/c1-7-8-13-12(4)16(10-15(13)20)22-18(21)17-14(9-11(2)3)19(17,5)6/h1,9,14,16-17H,8,10H2,2-6H3
46 atoms
O  -0.109183 -0.521496 1.217224
O  -1.121985 1.325273 0.457974
O  3.991036 -0.989089 3.252174
C  -3.671438 -0.437758 0.250087
C  -2.953748 -0.7373 -1.029193
C  -2.206673 -0.814749 0.3063
C  -4.1453 0.961033 0.55925
C  -4.617189 -1.498878 0.763875
C  -2.649746 0.285991 -2.045524
C  -1.130323 0.136709 0.648069
C  -2.795719 0.148526 -3.366587
C  1.046624 0.213263 1.617221
C  -2.440761 1.275838 -4.290485
C  -3.303814 -1.078134 -4.062816
C  1.662466 -0.42145 2.856731
C  2.127724 0.143753 0.5634
C  3.290299 -0.274674 1.079722
C  3.124725 -0.614805 2.504511
C  1.851894 0.558284 -0.835254
C  4.61851 -0.415371 0.395857
C  5.112886 0.83629 -0.163076
C  5.511761 1.868851 -0.626033
H  -3.151275 -1.725249 -1.429452
H  -2.00092 -1.823533 0.64461
H  -3.496653 1.74246 0.178452
H  -5.136066 1.107469 0.125963
H  -4.232757 1.102601 1.637754
H  -4.722729 -1.435431 1.848382
H  -5.608385 -1.373441 0.324739
H  -4.274431 -2.506307 0.523256
H  -2.275876 1.235678 -1.684001
H  0.774497 1.258104 1.788835
H  1.211251 -1.393309 3.066347
H  1.556718 0.18522 3.756232
H  -3.306701 1.593135 -4.877044
H  -2.064014 2.144615 -3.752474
H  -1.675769 0.968866 -5.008593
H  -4.17087 -0.833905 -4.681187
H  -2.545375 -1.479232 -4.739855
H  -3.601803 -1.87844 -3.389644
H  1.432389 1.564956 -0.861024
H  1.110181 -0.098763 -1.2949
H  2.747533 0.544482 -1.45167
H  5.34318 -0.797366 1.11941
H  4.557173 -1.165096 -0.398651
H  5.872796 2.78437 -1.027766
totalener: -964.14810055 hartree
nucrepener: 1762.53888667 hartree
electener: -2726.68698722 hartree
oneelecener: -4809.67847657 hartree
twoeener: 2082.99148934 hartree
kineticenergy: 959.81553726 hartree
xcener: -94.699223426846 hartree
chargesum: -0.0000000
charge: -0.278037 -0.396859 -0.330635 0.092047 0.042994 -0.091476 -0.253615 -0.238968 -0.249200 0.329067 -0.042035 0.221751 -0.204558 -0.241786 -0.138903 -0.055568 -0.061262 0.221975 -0.229878 -0.155370 -0.423059 0.101534 0.087893 0.082828 0.103341 0.086366 0.086794 0.089633 0.089973 0.070612 0.111476 0.100306 0.090945 0.087401 0.084138 0.081310 0.081754 0.086508 0.088680 0.077485 0.114337 0.101671 0.095750 0.117727 0.120420 0.244496
qa: -0.2780 -0.3969 -0.3306 0.0920 0.0430 -0.0915 -0.2536 -0.2390 -0.2492 0.3291 -0.0420 0.2218 -0.2046 -0.2418 -0.1389 -0.0556 -0.0613 0.2220 -0.2299 -0.1554 -0.4231 0.1015 0.0879 0.0828 0.1033 0.0864 0.0868 0.0896 0.0900 0.0706 0.1115 0.1003 0.0909 0.0874 0.0841 0.0813 0.0818 0.0865 0.0887 0.0775 0.1143 0.1017 0.0957 0.1177 0.1204 0.2445
va: 2.1229 2.0861 2.1727 3.7402 3.7811 3.8911 3.9201 3.9079 3.8981 4.1702 3.7988 3.7705 3.9388 3.9474 3.8762 3.7272 3.4947 4.1100 3.9444 3.9016 3.8677 3.5648 1.0093 1.0305 1.0187 1.0023 1.0023 1.0050 1.0041 1.0082 1.0242 1.0273 1.0315 1.0284 0.9986 1.0122 0.9981 1.0000 0.9986 1.0164 1.0080 1.0045 1.0092 1.0199 0.9849 0.9733
dispcorr: -0.021413121 hartree
energy: -964.169513670660
dipole: -25.71528 24.40075 -1.31454 -0.14210 -0.16338 -0.30548 -18.34030 17.28334 -1.05696
magnitude: 1.71420 au
magnitude: 4.35715 debye
