program: Orca
programVersion: 5.0.2
elementType: O O O C C C C C C C C C C C C C C C C C C C H H H H H H H H H H H H H H H H H H H H H H H H
charge: 0
multiplicity: 1
keywords: wb97x-d3
keywords: def2-TZVPP
keywords: def2/J RIJCOSX
keywords: DEFGRID2
keywords: scfconv7
keywords: smallprint printgap noloewdin
keywords: NOSOSCF
formula: C19H24O3
InChI: InChI=1/C19H24O3/c1-7-8-13-12(4)16(10-15(13)20)22-18(21)17-14(9-11(2)3)19(17,5)6/h1,9,14,16-17H,8,10H2,2-6H3
46 atoms
O  0.191395 -1.533757 -0.658364
O  0.177382 0.536113 0.187871
O  3.863745 0.991314 -2.253374
C  -2.444094 -0.545526 1.571097
C  -2.775151 0.380647 0.452399
C  -1.822031 -0.77885 0.199688
C  -1.597805 -0.037412 2.71294
C  -3.448795 -1.5863 2.003141
C  -4.09533 0.415966 -0.218941
C  -0.406659 -0.49183 -0.071412
C  -4.370992 1.142704 -1.306219
C  1.575213 -1.445741 -0.996781
C  -5.745905 1.165873 -1.900471
C  -3.357613 1.992603 -2.011326
C  1.929125 -0.467473 -2.111878
C  2.472032 -1.071888 0.153947
C  3.398301 -0.176113 -0.220086
C  3.171118 0.228679 -1.606773
C  2.321872 -1.700203 1.487816
C  4.497666 0.386418 0.630396
C  3.971739 1.197882 1.722085
C  3.50079 1.849262 2.616407
H  -2.267125 1.338773 0.509593
H  -2.2235 -1.628166 -0.340796
H  -0.977157 -0.835876 3.124691
H  -2.245261 0.320292 3.5156
H  -0.946853 0.786977 2.43154
H  -3.994912 -2.021325 1.166892
H  -4.177759 -1.153119 2.690715
H  -2.946817 -2.401763 2.526437
H  -4.892424 -0.178147 0.217521
H  1.818891 -2.466705 -1.298392
H  1.147906 0.273756 -2.290737
H  2.122513 -0.963787 -3.062895
H  -6.449757 0.556369 -1.33421
H  -6.137451 2.185598 -1.940855
H  -5.732512 0.800861 -2.930529
H  -3.54361 3.054163 -1.826906
H  -2.332269 1.778296 -1.713263
H  -3.425614 1.85257 -3.092259
H  1.873201 -2.690474 1.4177
H  1.670768 -1.091664 2.121349
H  3.279047 -1.786548 2.001386
H  5.103659 -0.421909 1.049046
H  5.172574 0.989967 0.01983
H  3.105005 2.436857 3.414111
elementType: O C H
totalener: -964.16000459 hartree
nucrepener: 1805.47104813 hartree
electener: -2769.63105272 hartree
oneelecener: -4896.42460876 hartree
twoeener: 2126.79355604 hartree
cpcmener: -0.04186254 hartree
kineticenergy: 959.77290960 hartree
xcener: -94.701146937910 hartree
chargesum: -0.0000000
charge: -0.303398 -0.495766 -0.488230 0.155738 -0.052492 -0.074475 -0.283487 -0.296942 -0.275676 0.401947 -0.014485 0.291398 -0.228900 -0.259739 -0.155057 0.012845 -0.136352 0.303544 -0.282334 -0.096345 -0.438520 0.009667 0.101827 0.092596 0.098568 0.101226 0.093803 0.090335 0.103932 0.099345 0.125960 0.122313 0.116299 0.109741 0.088824 0.094958 0.094974 0.104043 0.082771 0.094769 0.119747 0.114586 0.121763 0.136186 0.107090 0.291404
qa: -0.3034 -0.4958 -0.4882 0.1557 -0.0525 -0.0745 -0.2835 -0.2969 -0.2757 0.4019 -0.0145 0.2914 -0.2289 -0.2597 -0.1551 0.0128 -0.1364 0.3035 -0.2823 -0.0963 -0.4385 0.0097 0.1018 0.0926 0.0986 0.1012 0.0938 0.0903 0.1039 0.0993 0.1260 0.1223 0.1163 0.1097 0.0888 0.0950 0.0950 0.1040 0.0828 0.0948 0.1197 0.1146 0.1218 0.1362 0.1071 0.2914
va: 2.1314 2.0064 2.0117 3.7263 3.8284 3.8187 3.8878 3.9156 3.8832 4.1475 3.7049 3.7758 3.9294 3.9475 3.8827 3.6463 3.5196 4.0344 3.9377 3.8903 3.8017 3.5691 1.0222 1.0346 0.9992 1.0026 1.0157 1.0019 0.9983 1.0017 1.0048 0.9922 1.0228 1.0231 1.0073 0.9946 0.9962 0.9963 1.0128 0.9992 1.0063 0.9941 0.9950 0.9894 1.0222 0.9447
dispcorr: -0.023038752 hartree
energy: -964.183043344718
dipole: -25.39886 23.69569 -1.70317 -1.49729 -0.93139 -2.42868 5.92956 -5.02299 0.90657
magnitude: 3.10179 au
magnitude: 7.88413 debye
