program: Orca
programVersion: 5.0.2
elementType: O O O C C C C C C C C C C C C C C C C C C C H H H H H H H H H H H H H H H H H H H H H H H H
charge: 0
multiplicity: 1
keywords: wb97x-d3
keywords: def2-TZVPP
keywords: def2/J RIJCOSX
keywords: DEFGRID2
keywords: scfconv7
keywords: smallprint printgap noloewdin
keywords: NOSOSCF
formula: C19H24O3
InChI: InChI=1/C19H24O3/c1-7-8-13-12(4)16(10-15(13)20)22-18(21)17-14(9-11(2)3)19(17,5)6/h1,9,14,16-17H,8,10H2,2-6H3
46 atoms
O  0.512516 -0.93926 -0.12169
O  -0.677977 -0.882045 1.777411
O  4.985834 -1.572097 -0.892618
C  -3.042292 -1.507138 -0.207444
C  -3.060522 -0.057937 0.169162
C  -1.773613 -0.679306 -0.34179
C  -3.17722 -2.537614 0.8866
C  -3.677511 -1.944895 -1.505207
C  -3.724686 0.973597 -0.65297
C  -0.62807 -0.84214 0.568978
C  -4.575685 1.909674 -0.220108
C  1.750952 -1.129396 0.570695
C  -5.161578 2.908982 -1.172162
C  -5.022883 2.068547 1.200673
C  2.679914 -1.999957 -0.264288
C  2.478419 0.183572 0.726525
C  3.71709 0.122015 0.215964
C  3.948291 -1.192678 -0.386634
C  1.843228 1.339301 1.399637
C  4.755806 1.202412 0.213175
C  4.491012 2.209218 -0.807834
C  4.251447 3.031751 -1.651178
H  -3.068758 0.115011 1.240046
H  -1.500805 -0.438408 -1.363228
H  -2.613819 -3.441288 0.645921
H  -4.22584 -2.82375 0.98656
H  -2.846304 -2.181312 1.859225
H  -3.495754 -1.250598 -2.324267
H  -4.758159 -2.042435 -1.383837
H  -3.290399 -2.919232 -1.80832
H  -3.485153 0.963554 -1.712383
H  1.56666 -1.569872 1.552519
H  2.272534 -2.184962 -1.260573
H  2.878983 -2.970077 0.191574
H  -4.923894 3.930021 -0.862433
H  -4.796371 2.772167 -2.189734
H  -6.252256 2.840013 -1.191416
H  -4.644469 1.299223 1.870667
H  -4.713068 3.038967 1.596889
H  -6.114007 2.048773 1.258945
H  2.531427 2.17344 1.52073
H  1.468104 1.05337 2.383692
H  0.985333 1.696604 0.825235
H  4.801285 1.688276 1.19056
H  5.742313 0.765554 0.042072
H  4.035032 3.755933 -2.404202
elementType: O C H
totalener: -964.16419663 hartree
nucrepener: 1742.59829593 hartree
electener: -2706.76249256 hartree
oneelecener: -4769.92785907 hartree
twoeener: 2063.16536651 hartree
cpcmener: -0.03878789 hartree
kineticenergy: 959.76207413 hartree
xcener: -94.696516963693 hartree
chargesum: 0.0000000
charge: -0.295066 -0.498063 -0.480796 0.109262 0.045986 -0.110838 -0.280602 -0.269390 -0.289366 0.415148 -0.044345 0.253847 -0.220499 -0.253849 -0.135956 -0.022575 -0.099989 0.315860 -0.247012 -0.101792 -0.458486 0.038739 0.093915 0.088569 0.100750 0.097519 0.090589 0.089153 0.097776 0.097607 0.121942 0.106540 0.103770 0.103509 0.093518 0.089209 0.094239 0.090435 0.097870 0.095120 0.102665 0.119048 0.117012 0.134957 0.111837 0.292237
qa: -0.2951 -0.4981 -0.4808 0.1093 0.0460 -0.1108 -0.2806 -0.2694 -0.2894 0.4151 -0.0443 0.2538 -0.2205 -0.2538 -0.1360 -0.0226 -0.1000 0.3159 -0.2470 -0.1018 -0.4585 0.0387 0.0939 0.0886 0.1007 0.0975 0.0906 0.0892 0.0978 0.0976 0.1219 0.1065 0.1038 0.1035 0.0935 0.0892 0.0942 0.0904 0.0979 0.0951 0.1027 0.1190 0.1170 0.1350 0.1118 0.2922
va: 2.1298 2.0003 2.0185 3.6862 3.7621 3.8772 3.9066 3.9099 3.8751 4.1395 3.7500 3.7469 3.9206 3.9428 3.9156 3.7510 3.5378 4.0288 3.9350 3.8780 3.8288 3.5330 1.0322 1.0390 0.9987 1.0001 1.0186 1.0056 1.0017 1.0021 1.0098 1.0300 1.0289 1.0224 0.9957 1.0087 0.9963 1.0092 0.9963 0.9974 1.0037 1.0058 0.9983 0.9889 1.0185 0.9435
dispcorr: -0.020826018 hartree
energy: -964.185022651706
dipole: -31.88746 29.84603 -2.04143 5.81660 -5.16188 0.65472 0.80223 -0.43370 0.36854
magnitude: 2.17529 au
magnitude: 5.52915 debye
