program: Orca
programVersion: 5.0.2
elementType: O O O C C C C C C C C C C C C C C C C C C C H H H H H H H H H H H H H H H H H H H H H H H H
charge: 0
multiplicity: 1
keywords: wb97x-d3
keywords: def2-TZVPP
keywords: def2/J RIJCOSX
keywords: DEFGRID2
keywords: scfconv7
keywords: smallprint printgap noloewdin
keywords: NOSOSCF
formula: C19H24O3
InChI: InChI=1/C19H24O3/c1-7-8-13-12(4)16(10-15(13)20)22-18(21)17-14(9-11(2)3)19(17,5)6/h1,9,14,16-17H,8,10H2,2-6H3
46 atoms
O  0.16883 -1.504219 -0.643289
O  0.166837 0.546674 0.244428
O  3.838381 1.017723 -2.255586
C  -2.475119 -0.561589 1.587264
C  -2.785989 0.408642 0.50141
C  -1.844665 -0.749504 0.213131
C  -1.635821 -0.104467 2.755535
C  -3.499405 -1.602635 1.968394
C  -4.105114 0.484402 -0.173864
C  -0.422504 -0.469112 -0.039404
C  -4.323485 1.117064 -1.330112
C  1.547803 -1.41426 -0.997005
C  -5.691577 1.194608 -1.934514
C  -3.241604 1.798349 -2.110234
C  1.88924 -0.419697 -2.101569
C  2.465405 -1.06292 0.145361
C  3.39449 -0.172447 -0.232147
C  3.150192 0.254197 -1.611404
C  2.330054 -1.708397 1.473312
C  4.513802 0.373138 0.602538
C  4.017347 1.19305 1.701559
C  3.586276 1.842136 2.616588
H  -2.267903 1.359084 0.596862
H  -2.251685 -1.573059 -0.362624
H  -0.944236 0.696031 2.501287
H  -1.058102 -0.932659 3.17181
H  -2.286512 0.270108 3.548895
H  -3.015885 -2.454088 2.451188
H  -4.053699 -1.985887 1.11162
H  -4.222434 -1.191607 2.676264
H  -4.947399 0.013232 0.324217
H  1.782279 -2.431615 -1.319651
H  1.112607 0.334081 -2.248747
H  2.055068 -0.898952 -3.067206
H  -5.708582 0.737968 -2.927845
H  -6.442977 0.69621 -1.321749
H  -6.00341 2.234053 -2.069273
H  -2.242833 1.617076 -1.71567
H  -3.251843 1.467691 -3.151843
H  -3.399907 2.880204 -2.131147
H  3.292331 -1.80184 1.976772
H  1.882548 -2.699142 1.39664
H  1.685518 -1.109617 2.122448
H  5.118873 -0.442401 1.008671
H  5.184518 0.96904 -0.020651
H  3.209633 2.417377 3.432171
elementType: O C H
totalener: -964.16972212 hartree
nucrepener: 1806.54621087 hartree
electener: -2770.71593298 hartree
oneelecener: -4898.45416181 hartree
twoeener: 2127.73822883 hartree
cpcmener: -0.03379867 hartree
kineticenergy: 959.77456803 hartree
xcener: -94.698428163355 hartree
chargesum: 0.0000000
charge: -0.297700 -0.464908 -0.451780 0.159936 -0.047986 -0.088160 -0.282285 -0.294679 -0.277464 0.379290 -0.012208 0.284953 -0.228377 -0.246824 -0.151428 0.009043 -0.125056 0.276343 -0.284154 -0.106724 -0.438014 0.022518 0.102765 0.089955 0.095006 0.096281 0.099436 0.097678 0.090582 0.101688 0.122635 0.118421 0.113372 0.105864 0.094739 0.088601 0.094279 0.078393 0.093672 0.101376 0.119073 0.117659 0.115873 0.132765 0.109167 0.286385
qa: -0.2977 -0.4649 -0.4518 0.1599 -0.0480 -0.0882 -0.2823 -0.2947 -0.2775 0.3793 -0.0122 0.2850 -0.2284 -0.2468 -0.1514 0.0090 -0.1251 0.2763 -0.2842 -0.1067 -0.4380 0.0225 0.1028 0.0900 0.0950 0.0963 0.0994 0.0977 0.0906 0.1017 0.1226 0.1184 0.1134 0.1059 0.0947 0.0886 0.0943 0.0784 0.0937 0.1014 0.1191 0.1177 0.1159 0.1328 0.1092 0.2864
va: 2.1309 2.0419 2.0568 3.7140 3.8326 3.8127 3.8870 3.9123 3.8783 4.1762 3.7084 3.7849 3.9291 3.9457 3.8704 3.6441 3.5023 4.0724 3.9384 3.8922 3.8100 3.5652 1.0247 1.0350 1.0161 0.9997 1.0028 1.0026 1.0015 0.9986 1.0043 0.9919 1.0233 1.0240 0.9964 1.0070 0.9955 1.0163 0.9992 0.9981 0.9957 1.0059 0.9947 0.9897 1.0215 0.9478
dispcorr: -0.023141804 hartree
energy: -964.192863919619
dipole: -25.22149 23.61208 -1.60941 -2.00996 -0.25026 -2.26022 5.57233 -4.79155 0.78078
magnitude: 2.88243 au
magnitude: 7.32656 debye
