program: Orca
programVersion: 5.0.2
elementType: O O O C C C C C C C C C C C C C C C C C C C H H H H H H H H H H H H H H H H H H H H H H H H
charge: 0
multiplicity: 1
keywords: wb97x-d3
keywords: def2-TZVPP
keywords: def2/J RIJCOSX
keywords: DEFGRID2
keywords: scfconv7
keywords: smallprint printgap noloewdin
keywords: NOSOSCF
formula: C19H24O3
InChI: InChI=1/C19H24O3/c1-7-8-13-12(4)16(10-15(13)20)22-18(21)17-14(9-11(2)3)19(17,5)6/h1,9,14,16-17H,8,10H2,2-6H3
46 atoms
O  0.30286 -1.713101 -0.456151
O  0.229534 0.470896 0.01609
O  3.945148 0.670389 -2.271662
C  -2.447282 -0.462532 1.438184
C  -2.728307 0.318177 0.1905
C  -1.761752 -0.850705 0.137596
C  -1.664914 0.206798 2.541089
C  -3.469309 -1.444615 1.957876
C  -3.997573 0.226026 -0.556021
C  -0.330082 -0.593244 -0.09591
C  -4.639588 1.230814 -1.161409
C  1.697838 -1.661563 -0.758178
C  -5.901363 0.978183 -1.9311
C  -4.184736 2.659552 -1.164798
C  2.080383 -0.859949 -1.999279
C  2.549718 -1.101467 0.352567
C  3.463921 -0.242121 -0.118964
C  3.267228 -0.035437 -1.555606
C  2.36022 -1.536496 1.756217
C  4.513316 0.489476 0.661949
C  3.939397 1.594655 1.421189
C  3.439172 2.496195 2.039202
H  -2.237284 1.284685 0.16065
H  -2.132185 -1.765731 -0.311637
H  -1.087082 -0.524526 3.110781
H  -2.353366 0.690573 3.237075
H  -0.979203 0.971248 2.181294
H  -4.228593 -0.929382 2.549972
H  -2.992564 -2.183367 2.604986
H  -3.980314 -1.98853 1.164642
H  -4.429348 -0.767038 -0.640548
H  1.956615 -2.714554 -0.890546
H  1.283316 -0.200233 -2.346532
H  2.35316 -1.498182 -2.840744
H  -5.799135 1.306005 -2.969418
H  -6.176818 -0.07656 -1.939317
H  -6.739196 1.542371 -1.512377
H  -3.803399 2.942754 -2.151217
H  -5.022163 3.329926 -0.956012
H  -3.40352 2.877979 -0.438034
H  2.106498 -2.595725 1.815163
H  1.537689 -0.983367 2.218175
H  3.247594 -1.357795 2.362045
H  5.024142 -0.19041 1.349063
H  5.279288 0.874452 -0.015854
H  2.999035 3.290752 2.59863
elementType: O C H
totalener: -964.17134572 hartree
nucrepener: 1792.24880368 hartree
electener: -2756.42014941 hartree
oneelecener: -4869.93365602 hartree
twoeener: 2113.51350661 hartree
cpcmener: -0.03572188 hartree
kineticenergy: 959.76682603 hartree
xcener: -94.697180529046 hartree
chargesum: -0.0000000
charge: -0.295302 -0.461005 -0.449347 0.108457 0.038981 -0.101384 -0.284165 -0.273986 -0.281248 0.384645 -0.042842 0.281056 -0.217267 -0.260138 -0.148922 0.004933 -0.130877 0.278361 -0.269566 -0.111334 -0.434591 0.022035 0.091194 0.087424 0.094188 0.102106 0.095389 0.098374 0.096970 0.088238 0.115707 0.117932 0.112912 0.108007 0.092503 0.086803 0.093386 0.101329 0.092271 0.092839 0.117673 0.117923 0.111134 0.132166 0.111010 0.286030
qa: -0.2953 -0.4610 -0.4493 0.1085 0.0390 -0.1014 -0.2842 -0.2740 -0.2812 0.3846 -0.0428 0.2811 -0.2173 -0.2601 -0.1489 0.0049 -0.1309 0.2784 -0.2696 -0.1113 -0.4346 0.0220 0.0912 0.0874 0.0942 0.1021 0.0954 0.0984 0.0970 0.0882 0.1157 0.1179 0.1129 0.1080 0.0925 0.0868 0.0934 0.1013 0.0923 0.0928 0.1177 0.1179 0.1111 0.1322 0.1110 0.2860
va: 2.1333 2.0499 2.0584 3.6881 3.7773 3.8293 3.9053 3.9077 3.8880 4.1970 3.7580 3.7888 3.9223 3.9410 3.8601 3.6559 3.5160 4.0789 3.9421 3.8938 3.8130 3.5689 1.0346 1.0374 1.0001 1.0019 1.0162 1.0016 1.0015 1.0067 1.0121 0.9915 1.0250 1.0228 0.9954 1.0093 0.9966 0.9950 0.9982 1.0082 1.0024 0.9952 0.9998 0.9904 1.0184 0.9480
dispcorr: -0.022383265 hartree
energy: -964.193728988283
dipole: -27.38288 25.79967 -1.58321 0.55684 -2.71345 -2.15661 7.56536 -6.32833 1.23704
magnitude: 2.94750 au
magnitude: 7.49196 debye
