program: Orca
programVersion: 5.0.2
elementType: O O O C C C C C C C C C C C C C C C C C C C H H H H H H H H H H H H H H H H H H H H H H H H
charge: 0
multiplicity: 1
keywords: wb97x-d3
keywords: def2-TZVPP
keywords: def2/J RIJCOSX
keywords: DEFGRID2
keywords: scfconv7
keywords: smallprint printgap noloewdin
keywords: NOSOSCF
formula: C19H24O3
InChI: InChI=1/C19H24O3/c1-7-8-13-12(4)16(10-15(13)20)22-18(21)17-14(9-11(2)3)19(17,5)6/h1,9,14,16-17H,8,10H2,2-6H3
46 atoms
O  0.474877 -1.130963 -0.139488
O  -0.697623 -1.163227 1.769173
O  4.997803 -1.392889 -0.889542
C  -3.136948 -1.669091 -0.115407
C  -3.052329 -0.208768 0.191276
C  -1.820699 -0.944137 -0.332532
C  -3.306596 -2.636951 1.030918
C  -3.831484 -2.13563 -1.373812
C  -3.6858 0.835085 -0.63604
C  -0.661706 -1.095516 0.563222
C  -3.979281 2.082913 -0.253232
C  1.727719 -1.212584 0.546945
C  -4.647208 3.035906 -1.199155
C  -3.691542 2.657955 1.100501
C  2.725986 -2.003864 -0.28669
C  2.33675 0.161772 0.686702
C  3.574579 0.2055 0.173336
C  3.927633 -1.095671 -0.404685
C  1.600684 1.267624 1.34306
C  4.50783 1.378984 0.147037
C  4.100302 2.374283 -0.837678
C  3.753646 3.194337 -1.645053
H  -2.995151 0.007994 1.252406
H  -1.565664 -0.764412 -1.37084
H  -2.804454 -3.584096 0.822217
H  -4.367978 -2.854259 1.167568
H  -2.928831 -2.256542 1.976845
H  -3.614625 -1.513109 -2.241186
H  -4.91441 -2.147204 -1.233837
H  -3.520598 -3.152471 -1.62129
H  -3.933475 0.555722 -1.65579
H  1.585669 -1.659945 1.532982
H  2.336783 -2.21332 -1.28598
H  2.999826 -2.958595 0.163078
H  -5.591305 3.402006 -0.785982
H  -4.025313 3.918412 -1.372801
H  -4.859638 2.579121 -2.166026
H  -3.123746 1.996912 1.753381
H  -3.125211 3.588415 1.00437
H  -4.620216 2.917799 1.617357
H  1.230534 0.960381 2.322716
H  0.728415 1.558335 0.751807
H  2.218957 2.154122 1.471985
H  4.556086 1.848892 1.132885
H  5.521395 1.039846 -0.080089
H  3.439167 3.91677 -2.364466
elementType: O C H
totalener: -964.17378341 hartree
nucrepener: 1756.87242499 hartree
electener: -2721.04620840 hartree
oneelecener: -4798.43343203 hartree
twoeener: 2077.38722363 hartree
cpcmener: -0.03129498 hartree
kineticenergy: 959.75164631 hartree
xcener: -94.692554664122 hartree
chargesum: 0.0000000
charge: -0.292711 -0.471506 -0.444420 0.114777 -0.002784 -0.070746 -0.276531 -0.289021 -0.262262 0.379227 -0.032763 0.249715 -0.222701 -0.258506 -0.134121 -0.027267 -0.091093 0.287543 -0.248215 -0.104588 -0.459736 0.047516 0.100765 0.089953 0.097585 0.095277 0.092665 0.090446 0.101745 0.097082 0.114726 0.104963 0.101516 0.100099 0.092537 0.093484 0.087798 0.088977 0.093901 0.099098 0.118886 0.115375 0.101644 0.133075 0.111627 0.286969
qa: -0.2927 -0.4715 -0.4444 0.1148 -0.0028 -0.0707 -0.2765 -0.2890 -0.2623 0.3792 -0.0328 0.2497 -0.2227 -0.2585 -0.1341 -0.0273 -0.0911 0.2875 -0.2482 -0.1046 -0.4597 0.0475 0.1008 0.0900 0.0976 0.0953 0.0927 0.0904 0.1017 0.0971 0.1147 0.1050 0.1015 0.1001 0.0925 0.0935 0.0878 0.0890 0.0939 0.0991 0.1189 0.1154 0.1016 0.1331 0.1116 0.2870
va: 2.1269 2.0331 2.0630 3.7168 3.8160 3.8110 3.8981 3.9172 3.9003 4.1868 3.7506 3.7584 3.9243 3.9401 3.9007 3.7418 3.5159 4.0613 3.9363 3.8809 3.8339 3.5350 1.0220 1.0348 0.9994 1.0001 1.0201 1.0059 0.9996 1.0014 1.0116 1.0305 1.0292 1.0237 0.9953 0.9967 1.0088 1.0116 0.9972 0.9967 1.0070 0.9978 1.0034 0.9884 1.0196 0.9470
dispcorr: -0.021048184 hartree
energy: -964.194831595837
dipole: -29.51603 27.62635 -1.88968 6.92540 -6.25749 0.66791 0.97793 -0.65566 0.32227
magnitude: 2.02999 au
magnitude: 5.15982 debye
