program: Orca
programVersion: 5.0.2
elementType: O O O C C C C C C C C C C C C C C C C C C C H H H H H H H H H H H H H H H H H H H H H H H H
charge: 0
multiplicity: 1
keywords: wb97x-d3
keywords: def2-TZVPP
keywords: def2/J RIJCOSX
keywords: DEFGRID2
keywords: scfconv7
keywords: smallprint printgap noloewdin
keywords: NOSOSCF
formula: C19H24O3
InChI: InChI=1/C19H24O3/c1-7-8-13-12(4)16(10-15(13)20)22-18(21)17-14(9-11(2)3)19(17,5)6/h1,9,14,16-17H,8,10H2,2-6H3
46 atoms
O  0.365358 -1.135269 -0.195435
O  -0.624047 -0.709308 1.769161
O  4.913236 -1.500812 -1.037007
C  -3.194242 -1.751598 0.3074
C  -3.163268 -0.259228 0.286943
C  -1.946442 -1.045871 -0.195984
C  -3.194925 -2.455377 1.642583
C  -3.976655 -2.501299 -0.745403
C  -3.935574 0.567646 -0.66044
C  -0.703424 -0.94998 0.58765
C  -4.131733 1.886524 -0.556618
C  1.672664 -0.971857 0.356439
C  -4.968845 2.622614 -1.558888
C  -3.570382 2.740984 0.541949
C  2.649757 -1.949766 -0.279845
C  2.223039 0.396083 0.031609
C  3.453862 0.312806 -0.494529
C  3.836822 -1.094352 -0.656715
C  1.459804 1.625766 0.349492
C  4.368885 1.442931 -0.866311
C  4.784524 2.225244 0.291715
C  5.108469 2.87118 1.252141
H  -3.014309 0.183214 1.266091
H  -1.799761 -1.089878 -1.269205
H  -2.66669 -3.409414 1.583431
H  -4.223113 -2.670057 1.94047
H  -2.742846 -1.868637 2.438538
H  -5.038659 -2.522458 -0.492091
H  -3.632193 -3.535278 -0.807153
H  -3.88042 -2.069704 -1.741044
H  -4.38131 0.055815 -1.507828
H  1.639524 -1.101031 1.440617
H  2.232014 -2.39264 -1.187718
H  2.941047 -2.766041 0.380997
H  -5.400251 1.957621 -2.307285
H  -5.789307 3.155432 -1.070107
H  -4.378789 3.381021 -2.080631
H  -4.335069 2.974676 1.287903
H  -2.729643 2.286185 1.063508
H  -3.227423 3.698005 0.143479
H  1.273121 1.691923 1.423715
H  0.484017 1.621775 -0.141468
H  1.982602 2.528533 0.040645
H  5.253772 1.046634 -1.369759
H  3.879517 2.103205 -1.587581
H  5.392654 3.448047 2.103449
elementType: O C H
totalener: -964.17314221 hartree
nucrepener: 1752.60147230 hartree
electener: -2716.77461451 hartree
oneelecener: -4789.77082636 hartree
twoeener: 2072.99621185 hartree
cpcmener: -0.03066823 hartree
kineticenergy: 959.75479412 hartree
xcener: -94.693806659037 hartree
chargesum: -0.0000000
charge: -0.294123 -0.470354 -0.444925 0.114790 -0.012291 -0.056585 -0.273136 -0.292834 -0.267039 0.366231 -0.012323 0.254650 -0.226512 -0.272584 -0.136047 -0.031756 -0.086052 0.285984 -0.246095 -0.102990 -0.460994 0.048913 0.100216 0.090291 0.097143 0.095209 0.093046 0.103261 0.097840 0.089503 0.115019 0.105569 0.102550 0.098059 0.087334 0.093823 0.093710 0.105532 0.088335 0.093918 0.119471 0.114163 0.099928 0.110593 0.134288 0.287271
qa: -0.2941 -0.4704 -0.4449 0.1148 -0.0123 -0.0566 -0.2731 -0.2928 -0.2670 0.3662 -0.0123 0.2547 -0.2265 -0.2726 -0.1360 -0.0318 -0.0861 0.2860 -0.2461 -0.1030 -0.4610 0.0489 0.1002 0.0903 0.0971 0.0952 0.0930 0.1033 0.0978 0.0895 0.1150 0.1056 0.1026 0.0981 0.0873 0.0938 0.0937 0.1055 0.0883 0.0939 0.1195 0.1142 0.0999 0.1106 0.1343 0.2873
va: 2.1245 2.0320 2.0613 3.7532 3.8079 3.7998 3.8955 3.9179 3.9127 4.2014 3.7177 3.7533 3.9302 3.9452 3.9111 3.7437 3.5165 4.0596 3.9394 3.8766 3.8257 3.5314 1.0225 1.0346 0.9997 1.0000 1.0193 0.9989 1.0018 1.0046 1.0111 1.0318 1.0272 1.0252 1.0087 0.9942 0.9961 0.9957 1.0084 0.9984 1.0021 1.0019 1.0022 1.0209 0.9878 0.9467
dispcorr: -0.021234791 hartree
energy: -964.194376998043
dipole: -30.35081 28.14765 -2.20315 6.40595 -5.66825 0.73770 -0.69335 0.27329 -0.42006
magnitude: 2.36105 au
magnitude: 6.00131 debye
