program: Orca
programVersion: 5.0.2
elementType: O O O C C C C C C C C C C C C C C C C C C C H H H H H H H H H H H H H H H H H H H H H H H H
charge: 0
multiplicity: 1
keywords: wb97x-d3
keywords: def2-TZVPP
keywords: def2/J RIJCOSX
keywords: DEFGRID2
keywords: scfconv7
keywords: smallprint printgap noloewdin
keywords: NOSOSCF
formula: C19H24O3
InChI: InChI=1/C19H24O3/c1-7-8-13-12(4)16(10-15(13)20)22-18(21)17-14(9-11(2)3)19(17,5)6/h1,9,14,16-17H,8,10H2,2-6H3
46 atoms
O  0.326849 -1.106505 -0.192819
O  -0.65475 -0.702679 1.780299
O  4.87463 -1.482444 -1.039709
C  -3.213471 -1.782631 0.318572
C  -3.217833 -0.292682 0.336814
C  -1.986485 -1.034159 -0.17857
C  -3.1779 -2.524642 1.632411
C  -3.990517 -2.519116 -0.746828
C  -4.023658 0.543269 -0.580133
C  -0.739322 -0.933681 0.597041
C  -4.03084 1.880081 -0.583506
C  1.63626 -0.952554 0.35709
C  -4.914314 2.651392 -1.515631
C  -3.186939 2.720719 0.326564
C  2.608805 -1.92903 -0.28834
C  2.190947 0.415531 0.041682
C  3.420078 0.332316 -0.488285
C  3.798489 -1.075173 -0.659336
C  1.429708 1.643654 0.369323
C  4.338378 1.461493 -0.854383
C  4.765075 2.229608 0.309093
C  5.093122 2.871532 1.270849
H  -3.065722 0.130803 1.324606
H  -1.849469 -1.047151 -1.253851
H  -2.715793 -1.955311 2.4353
H  -2.638792 -3.469237 1.533771
H  -4.196565 -2.761379 1.945845
H  -3.611367 -3.536762 -0.857388
H  -3.931615 -2.04376 -1.725566
H  -5.045173 -2.589712 -0.472401
H  -4.663292 0.028273 -1.290528
H  1.604795 -1.08969 1.440315
H  2.188454 -2.362436 -1.19962
H  2.897437 -2.752316 0.364989
H  -5.53891 2.000949 -2.127876
H  -5.572819 3.32729 -0.96294
H  -4.322257 3.280513 -2.1858
H  -3.796035 3.182183 1.109375
H  -2.387042 2.16515 0.814112
H  -2.726262 3.541577 -0.22796
H  0.465872 1.654888 -0.145081
H  1.964093 2.549887 0.092068
H  1.21713 1.687426 1.439899
H  5.218385 1.065698 -1.366755
H  3.848383 2.131234 -1.566392
H  5.399522 3.425526 2.129732
elementType: O C H
totalener: -964.17284602 hartree
nucrepener: 1758.18156185 hartree
electener: -2722.35440787 hartree
oneelecener: -4800.90735910 hartree
twoeener: 2078.55295123 hartree
cpcmener: -0.03046074 hartree
kineticenergy: 959.75613647 hartree
xcener: -94.693818242560 hartree
chargesum: -0.0000000
charge: -0.293572 -0.470849 -0.445055 0.135154 -0.039905 -0.051813 -0.272092 -0.293984 -0.263110 0.360491 -0.009859 0.250977 -0.229169 -0.268375 -0.135687 -0.026850 -0.089128 0.287230 -0.247338 -0.102973 -0.461909 0.050300 0.101083 0.090277 0.093569 0.097743 0.094925 0.098825 0.087590 0.103802 0.120787 0.106018 0.102413 0.098002 0.087321 0.094044 0.094044 0.106436 0.079525 0.095128 0.114128 0.100274 0.119430 0.110984 0.133908 0.287261
qa: -0.2936 -0.4708 -0.4451 0.1352 -0.0399 -0.0518 -0.2721 -0.2940 -0.2631 0.3605 -0.0099 0.2510 -0.2292 -0.2684 -0.1357 -0.0268 -0.0891 0.2872 -0.2473 -0.1030 -0.4619 0.0503 0.1011 0.0903 0.0936 0.0977 0.0949 0.0988 0.0876 0.1038 0.1208 0.1060 0.1024 0.0980 0.0873 0.0940 0.0940 0.1064 0.0795 0.0951 0.1141 0.1003 0.1194 0.1110 0.1339 0.2873
va: 2.1246 2.0293 2.0612 3.7659 3.8144 3.8049 3.8876 3.9174 3.8961 4.1960 3.7069 3.7608 3.9316 3.9491 3.9115 3.7299 3.5221 4.0604 3.9376 3.8762 3.8270 3.5281 1.0223 1.0346 1.0188 0.9997 1.0005 1.0021 1.0028 0.9982 1.0077 1.0319 1.0272 1.0252 1.0081 0.9946 0.9962 0.9972 1.0111 0.9983 1.0010 1.0033 1.0026 1.0206 0.9884 0.9467
dispcorr: -0.021591381 hartree
energy: -964.194437397478
dipole: -29.46735 27.29897 -2.16838 6.22443 -5.47745 0.74699 -0.99608 0.55479 -0.44129
magnitude: 2.33551 au
magnitude: 5.93639 debye
