program: Orca
programVersion: 5.0.2
elementType: O O O C C C C C C C C C C C C C C C C C C C H H H H H H H H H H H H H H H H H H H H H H H H
charge: 0
multiplicity: 1
keywords: wb97x-d3
keywords: def2-TZVPP
keywords: def2/J RIJCOSX
keywords: DEFGRID2
keywords: scfconv7
keywords: smallprint printgap noloewdin
keywords: NOSOSCF
formula: C19H24O3
InChI: InChI=1/C19H24O3/c1-7-8-13-12(4)16(10-15(13)20)22-18(21)17-14(9-11(2)3)19(17,5)6/h1,9,14,16-17H,8,10H2,2-6H3
46 atoms
O  0.418691 -0.966475 -0.18417
O  -0.595895 -0.390112 1.728938
O  4.921829 -1.677035 -0.970297
C  -3.093988 -1.588012 0.216444
C  -3.14855 -0.091014 0.214303
C  -1.88479 -0.792419 -0.247899
C  -3.077931 -2.300354 1.546369
C  -3.819832 -2.363254 -0.856621
C  -3.936807 0.684036 -0.763732
C  -0.656466 -0.68749 0.559835
C  -4.739482 1.718962 -0.493755
C  1.721184 -0.887484 0.398658
C  -5.462319 2.434944 -1.595049
C  -4.990107 2.273074 0.876167
C  2.634003 -1.947276 -0.201769
C  2.377438 0.429694 0.061266
C  3.596105 0.246741 -0.467739
C  3.876928 -1.187345 -0.599716
C  1.711983 1.718059 0.366398
C  4.590412 1.298169 -0.864026
C  5.15496 1.991264 0.287673
C  5.610687 2.561497 1.242647
H  -3.064708 0.350433 1.201396
H  -1.713981 -0.816036 -1.318706
H  -2.512989 -3.233188 1.486322
H  -4.099536 -2.555901 1.83454
H  -2.655617 -1.701776 2.350471
H  -4.877029 -2.467021 -0.603473
H  -3.403083 -3.3681 -0.949103
H  -3.759078 -1.894789 -1.838081
H  -3.838325 0.383035 -1.80281
H  1.652794 -0.995095 1.483622
H  2.190573 -2.393348 -1.095645
H  2.868161 -2.75856 0.487541
H  -5.20638 3.498181 -1.60506
H  -5.229523 2.025515 -2.578245
H  -6.545476 2.381216 -1.455908
H  -4.565797 3.276996 0.970837
H  -6.063355 2.37585 1.056034
H  -4.581429 1.664882 1.681031
H  0.744505 1.789743 -0.135433
H  2.308578 2.574883 0.059915
H  1.519291 1.803549 1.438079
H  5.400043 0.838719 -1.436421
H  4.123746 2.029049 -1.529882
H  6.017621 3.063987 2.091292
elementType: O C H
totalener: -964.17426046 hartree
nucrepener: 1736.96283922 hartree
electener: -2701.13709968 hartree
oneelecener: -4758.53108903 hartree
twoeener: 2057.39398935 hartree
cpcmener: -0.03143745 hartree
kineticenergy: 959.75518971 hartree
xcener: -94.693327368666 hartree
chargesum: 0.0000000
charge: -0.290255 -0.467421 -0.444952 0.101319 0.048716 -0.104681 -0.276053 -0.268187 -0.282474 0.382878 -0.040522 0.253647 -0.218831 -0.256386 -0.136617 -0.036411 -0.087961 0.290099 -0.241520 -0.108526 -0.459743 0.050122 0.091752 0.086771 0.097938 0.095898 0.092544 0.097751 0.097378 0.087188 0.116359 0.105624 0.102017 0.098808 0.092155 0.088012 0.093401 0.099375 0.093009 0.091256 0.115074 0.098773 0.118743 0.112299 0.134623 0.287010
qa: -0.2903 -0.4674 -0.4450 0.1013 0.0487 -0.1047 -0.2761 -0.2682 -0.2825 0.3829 -0.0405 0.2536 -0.2188 -0.2564 -0.1366 -0.0364 -0.0880 0.2901 -0.2415 -0.1085 -0.4597 0.0501 0.0918 0.0868 0.0979 0.0959 0.0925 0.0978 0.0974 0.0872 0.1164 0.1056 0.1020 0.0988 0.0922 0.0880 0.0934 0.0994 0.0930 0.0913 0.1151 0.0988 0.1187 0.1123 0.1346 0.2870
va: 2.1267 2.0364 2.0615 3.7060 3.7609 3.8584 3.9067 3.9095 3.8836 4.1914 3.7545 3.7461 3.9223 3.9426 3.9104 3.7572 3.5118 4.0600 3.9386 3.8762 3.8259 3.5309 1.0339 1.0385 0.9995 1.0001 1.0189 1.0016 1.0021 1.0063 1.0115 1.0312 1.0281 1.0248 0.9956 1.0090 0.9967 0.9957 0.9980 1.0090 1.0019 1.0031 1.0024 1.0191 0.9879 0.9469
dispcorr: -0.020816370 hartree
energy: -964.195076826087
dipole: -32.87815 30.67558 -2.20258 5.49703 -4.78868 0.70835 -0.57174 0.17786 -0.39388
magnitude: 2.34696 au
magnitude: 5.96551 debye
