program: Orca
programVersion: 5.0.2
elementType: O O O C C C C C C C C C C C C C C C C C C C H H H H H H H H H H H H H H H H H H H H H H H H
charge: 0
multiplicity: 1
keywords: wb97x-d3
keywords: def2-TZVPP
keywords: def2/J RIJCOSX
keywords: DEFGRID2
keywords: scfconv7
keywords: smallprint printgap noloewdin
keywords: NOSOSCF
formula: C19H24O3
InChI: InChI=1/C19H24O3/c1-7-8-13-12(4)16(10-15(13)20)22-18(21)17-14(9-11(2)3)19(17,5)6/h1,9,14,16-17H,8,10H2,2-6H3
46 atoms
O  0.516984 -0.944091 -0.122525
O  -0.665395 -0.884812 1.780705
O  5.001386 -1.626698 -0.86268
C  -3.042395 -1.495388 -0.18672
C  -3.046807 -0.040382 0.170184
C  -1.76762 -0.680147 -0.334432
C  -3.189007 -2.50481 0.925329
C  -3.682004 -1.94521 -1.478146
C  -3.70882 0.98625 -0.661032
C  -0.618756 -0.843616 0.57446
C  -4.58943 1.898389 -0.237308
C  1.759169 -1.130448 0.561084
C  -5.166293 2.906507 -1.185291
C  -5.071286 2.021321 1.176743
C  2.679309 -2.014165 -0.269978
C  2.494104 0.180981 0.696138
C  3.735853 0.101794 0.196594
C  3.963471 -1.227357 -0.381112
C  1.859883 1.353314 1.342169
C  4.785974 1.172015 0.187397
C  4.485719 2.23129 -0.768136
C  4.221911 3.101571 -1.553974
H  -3.049134 0.14744 1.238855
H  -1.49528 -0.455136 -1.359859
H  -2.653119 -3.427924 0.693961
H  -4.243655 -2.761236 1.045623
H  -2.833358 -2.141242 1.886777
H  -3.497105 -1.26181 -2.306102
H  -4.76371 -2.035818 -1.358315
H  -3.29969 -2.92487 -1.771714
H  -3.438724 0.996504 -1.713191
H  1.580912 -1.557808 1.550409
H  2.275237 -2.180709 -1.271448
H  2.856371 -2.992895 0.176845
H  -4.968285 3.925913 -0.842409
H  -4.76052 2.807059 -2.192085
H  -6.253609 2.810252 -1.24873
H  -4.817246 1.167939 1.802156
H  -4.660741 2.915976 1.652189
H  -6.157603 2.132546 1.20201
H  2.554049 2.182767 1.463673
H  1.463327 1.088037 2.323858
H  1.016711 1.713102 0.747207
H  4.891632 1.608495 1.183961
H  5.755447 0.731347 -0.056767
H  3.987731 3.879459 -2.245286
elementType: O C H
totalener: -964.17408748 hartree
nucrepener: 1742.22604777 hartree
electener: -2706.40013524 hartree
oneelecener: -4769.14994061 hartree
twoeener: 2062.74980537 hartree
cpcmener: -0.03133658 hartree
kineticenergy: 959.76245132 hartree
xcener: -94.694013532155 hartree
chargesum: 0.0000000
charge: -0.290130 -0.469340 -0.444646 0.114890 0.045746 -0.118632 -0.282781 -0.265752 -0.287794 0.392485 -0.030741 0.249550 -0.221303 -0.260081 -0.133382 -0.028734 -0.091077 0.287544 -0.246810 -0.104041 -0.459208 0.046288 0.093357 0.086318 0.098504 0.096261 0.092737 0.087220 0.097207 0.097005 0.117046 0.103771 0.101597 0.100196 0.093182 0.087688 0.093573 0.091744 0.100934 0.092558 0.100425 0.118547 0.116001 0.133111 0.111599 0.287371
qa: -0.2901 -0.4693 -0.4446 0.1149 0.0457 -0.1186 -0.2828 -0.2658 -0.2878 0.3925 -0.0307 0.2495 -0.2213 -0.2601 -0.1334 -0.0287 -0.0911 0.2875 -0.2468 -0.1040 -0.4592 0.0463 0.0934 0.0863 0.0985 0.0963 0.0927 0.0872 0.0972 0.0970 0.1170 0.1038 0.1016 0.1002 0.0932 0.0877 0.0936 0.0917 0.1009 0.0926 0.1004 0.1185 0.1160 0.1331 0.1116 0.2874
va: 2.1284 2.0353 2.0630 3.6869 3.7620 3.8858 3.9070 3.9091 3.8897 4.1735 3.7364 3.7542 3.9249 3.9446 3.9027 3.7438 3.5175 4.0598 3.9373 3.8819 3.8331 3.5337 1.0314 1.0399 0.9992 1.0003 1.0191 1.0056 1.0022 1.0024 1.0107 1.0306 1.0293 1.0236 0.9950 1.0091 0.9966 1.0072 0.9953 0.9984 1.0034 1.0068 0.9986 0.9882 1.0202 0.9468
dispcorr: -0.020872685 hartree
energy: -964.194960161901
dipole: -32.00832 30.08742 -1.92089 5.91963 -5.26543 0.65421 0.68075 -0.36330 0.31745
magnitude: 2.05392 au
magnitude: 5.22064 debye
