program: Orca
programVersion: 5.0.2
elementType: O O O C C C C C C C C C C C C C C C C C C C H H H H H H H H H H H H H H H H H H H H H H H H
charge: 0
multiplicity: 1
keywords: wb97x-d3
keywords: def2-TZVPP
keywords: def2/J RIJCOSX
keywords: DEFGRID2
keywords: scfconv7
keywords: smallprint printgap noloewdin
keywords: NOSOSCF
formula: C19H24O3
InChI: InChI=1/C19H24O3/c1-7-8-13-12(4)16(10-15(13)20)22-18(21)17-14(9-11(2)3)19(17,5)6/h1,9,14,16-17H,8,10H2,2-6H3
46 atoms
O  0.333485 -1.039129 -0.099612
O  -0.762286 -1.153915 1.854164
O  4.859968 -1.42301 -0.91421
C  -3.227952 -1.722335 0.003729
C  -3.232236 -0.297875 0.434432
C  -1.975598 -0.879397 -0.187955
C  -3.272658 -2.810091 1.04844
C  -3.944939 -2.09346 -1.273246
C  -4.010327 0.750417 -0.270204
C  -0.775396 -1.045225 0.655389
C  -3.593358 2.005238 -0.445461
C  1.603729 -1.163063 0.53924
C  -4.455759 3.035476 -1.106694
C  -2.244372 2.469399 0.031041
C  2.558851 -1.963476 -0.336912
C  2.255435 0.191068 0.689807
C  3.483005 0.210692 0.157093
C  3.802244 -1.09875 -0.439315
C  1.552929 1.299776 1.383648
C  4.463691 1.345024 0.131471
C  3.954962 2.513957 -0.574493
C  3.521414 3.473273 -1.150306
H  -3.14133 -0.156088 1.509557
H  -1.769828 -0.598258 -1.214541
H  -2.780284 -3.716054 0.690052
H  -4.311873 -3.06533 1.263595
H  -2.801957 -2.519772 1.984003
H  -3.881644 -1.311631 -2.030075
H  -5.002892 -2.281265 -1.078936
H  -3.522077 -3.004338 -1.699875
H  -5.001992 0.476444 -0.618497
H  1.474134 -1.621338 1.523113
H  2.143887 -2.108884 -1.336519
H  2.797413 -2.949345 0.062012
H  -4.641818 3.877402 -0.435209
H  -3.9663 3.447115 -1.992847
H  -5.419931 2.630441 -1.411223
H  -1.448242 1.796866 -0.29204
H  -2.00644 3.465039 -0.342648
H  -2.199627 2.512622 1.121728
H  0.740795 1.683485 0.761544
H  2.214545 2.136373 1.597245
H  1.102671 0.953388 2.31442
H  4.737966 1.631644 1.151308
H  5.384844 1.002417 -0.346457
H  3.146213 4.322308 -1.668441
totalener: -964.14790394 hartree
nucrepener: 1782.41503895 hartree
electener: -2746.56294289 hartree
oneelecener: -4849.33561212 hartree
twoeener: 2102.77266923 hartree
kineticenergy: 959.81633122 hartree
xcener: -94.697107015947 hartree
chargesum: 0.0000000
charge: -0.272580 -0.391793 -0.329479 0.122329 0.002754 -0.127363 -0.257621 -0.274630 -0.259324 0.316225 0.039808 0.212101 -0.221894 -0.290867 -0.133831 -0.028910 -0.064931 0.218595 -0.260420 -0.158232 -0.410852 0.088060 0.101954 0.098022 0.085661 0.084701 0.102157 0.086190 0.091418 0.092184 0.094161 0.098984 0.091450 0.088497 0.094737 0.088419 0.076772 0.092367 0.095380 0.109738 0.105875 0.099747 0.121762 0.118391 0.119342 0.244947
qa: -0.2726 -0.3918 -0.3295 0.1223 0.0028 -0.1274 -0.2576 -0.2746 -0.2593 0.3162 0.0398 0.2121 -0.2219 -0.2909 -0.1338 -0.0289 -0.0649 0.2186 -0.2604 -0.1582 -0.4109 0.0881 0.1020 0.0980 0.0857 0.0847 0.1022 0.0862 0.0914 0.0922 0.0942 0.0990 0.0915 0.0885 0.0947 0.0884 0.0768 0.0924 0.0954 0.1097 0.1059 0.0997 0.1218 0.1184 0.1193 0.2449
va: 2.1109 2.1043 2.1733 3.7679 3.8040 3.8348 3.9013 3.9118 3.8982 4.2158 3.6564 3.7875 3.9435 3.9516 3.8736 3.6767 3.4926 4.1080 3.9519 3.9158 3.8621 3.5789 1.0278 1.0279 1.0022 1.0025 1.0206 1.0049 1.0015 1.0065 1.0100 1.0298 1.0318 1.0279 0.9943 0.9958 1.0113 0.9990 1.0091 0.9921 0.9983 1.0042 1.0103 0.9855 1.0195 0.9733
dispcorr: -0.022721077 hartree
energy: -964.170625015450
dipole: -26.35069 24.99039 -1.36030 6.17930 -5.63740 0.54190 -0.77809 0.89483 0.11674
magnitude: 1.46891 au
magnitude: 3.73367 debye
