program: Orca
programVersion: 5.0.2
elementType: O O O C C C C C C C C C C C C C C C C C C C H H H H H H H H H H H H H H H H H H H H H H H H
charge: 0
multiplicity: 1
keywords: wb97x-d3
keywords: def2-TZVPP
keywords: def2/J RIJCOSX
keywords: DEFGRID2
keywords: scfconv7
keywords: smallprint printgap noloewdin
keywords: NOSOSCF
formula: C19H24O3
InChI: InChI=1/C19H24O3/c1-7-8-13-12(4)16(10-15(13)20)22-18(21)17-14(9-11(2)3)19(17,5)6/h1,9,14,16-17H,8,10H2,2-6H3
46 atoms
O  0.554593 -0.904704 -0.144865
O  -0.608736 -0.822667 1.771694
O  5.045116 -1.76098 -0.788134
C  -3.020732 -1.394312 -0.157352
C  -2.983132 0.061286 0.196804
C  -1.733149 -0.605799 -0.328682
C  -3.164561 -2.406708 0.952394
C  -3.710345 -1.811039 -1.434308
C  -3.650909 1.097576 -0.623471
C  -0.573911 -0.787944 0.569591
C  -4.721839 1.808957 -0.26632
C  1.790199 -1.109435 0.538975
C  -5.300277 2.847478 -1.179988
C  -5.436044 1.647512 1.04095
C  2.687045 -2.042354 -0.264697
C  2.56607 0.18192 0.643146
C  3.809233 0.049972 0.164807
C  4.012996 -1.311156 -0.361927
C  1.951624 1.390107 1.247357
C  4.902271 1.076137 0.131445
C  4.562358 2.235466 -0.683087
C  4.271635 3.189665 -1.349882
H  -2.952319 0.253963 1.264621
H  -1.466409 -0.389808 -1.357779
H  -2.696783 -3.354983 0.680059
H  -4.223622 -2.603916 1.128907
H  -2.726909 -2.07508 1.890433
H  -3.56174 -1.100439 -2.246228
H  -4.786084 -1.897791 -1.272175
H  -3.343773 -2.78213 -1.771082
H  -3.219831 1.290716 -1.601795
H  1.591841 -1.500042 1.540616
H  2.290241 -2.19333 -1.27081
H  2.812582 -3.026771 0.186226
H  -6.338106 2.615301 -1.431691
H  -5.308791 3.830557 -0.702659
H  -4.740467 2.933192 -2.110479
H  -5.413129 2.57692 1.615272
H  -6.490154 1.413293 0.873649
H  -5.021668 0.858176 1.664209
H  1.177078 1.791367 0.590002
H  2.677879 2.183271 1.410817
H  1.467535 1.148555 2.194454
H  5.142083 1.406273 1.146684
H  5.809454 0.609448 -0.260323
H  4.019888 4.03163 -1.947945
totalener: -964.15027568 hartree
nucrepener: 1741.46868639 hartree
electener: -2705.61896207 hartree
oneelecener: -4767.49455471 hartree
twoeener: 2061.87559264 hartree
kineticenergy: 959.81879714 hartree
xcener: -94.697244404660 hartree
chargesum: -0.0000000
charge: -0.275651 -0.391745 -0.329537 0.130896 0.006207 -0.140367 -0.273584 -0.231938 -0.198679 0.337599 -0.028925 0.219883 -0.209999 -0.238009 -0.132824 -0.045214 -0.061225 0.219337 -0.240193 -0.160766 -0.418432 0.097564 0.097568 0.074483 0.087041 0.085428 0.101915 0.074483 0.089475 0.091486 0.082111 0.096497 0.091049 0.087698 0.084718 0.085863 0.078072 0.090089 0.084515 0.082835 0.104260 0.094038 0.119186 0.118975 0.119113 0.244707
qa: -0.2757 -0.3917 -0.3295 0.1309 0.0062 -0.1404 -0.2736 -0.2319 -0.1987 0.3376 -0.0289 0.2199 -0.2100 -0.2380 -0.1328 -0.0452 -0.0612 0.2193 -0.2402 -0.1608 -0.4184 0.0976 0.0976 0.0745 0.0870 0.0854 0.1019 0.0745 0.0895 0.0915 0.0821 0.0965 0.0910 0.0877 0.0847 0.0859 0.0781 0.0901 0.0845 0.0828 0.1043 0.0940 0.1192 0.1190 0.1191 0.2447
va: 2.1229 2.1067 2.1734 3.7072 3.7746 3.9478 3.9131 3.9064 3.8961 4.2290 3.7658 3.7693 3.9394 3.9488 3.8749 3.7164 3.4872 4.1102 3.9483 3.9150 3.8651 3.5715 1.0282 1.0422 1.0025 1.0021 1.0204 1.0092 1.0061 1.0049 1.0172 1.0306 1.0318 1.0279 0.9986 0.9978 1.0117 0.9994 0.9999 1.0119 1.0019 1.0048 1.0087 0.9852 1.0199 0.9733
dispcorr: -0.021107803 hartree
energy: -964.171383480152
dipole: -32.99449 31.46015 -1.53434 5.61651 -5.08329 0.53323 0.23856 -0.10708 0.13149
magnitude: 1.62967 au
magnitude: 4.14229 debye
