program: Orca
programVersion: 5.0.2
elementType: O O O C C C C C C C C C C C C C C C C C C C H H H H H H H H H H H H H H H H H H H H H H H H
charge: 0
multiplicity: 1
keywords: wb97x-d3
keywords: def2-TZVPP
keywords: def2/J RIJCOSX
keywords: DEFGRID2
keywords: scfconv7
keywords: smallprint printgap noloewdin
keywords: NOSOSCF
formula: C19H24O3
InChI: InChI=1/C19H24O3/c1-7-8-13-12(4)16(10-15(13)20)22-18(21)17-14(9-11(2)3)19(17,5)6/h1,9,14,16-17H,8,10H2,2-6H3
46 atoms
O  0.265524 -1.033479 -0.17247
O  -0.666657 -0.720962 1.843986
O  4.758783 -1.456762 -1.194079
C  -3.231274 -1.785574 0.357978
C  -3.284979 -0.306133 0.515935
C  -2.04841 -0.942585 -0.093279
C  -3.130094 -2.650017 1.590879
C  -4.019132 -2.430969 -0.75748
C  -4.165391 0.557938 -0.31053
C  -0.778925 -0.890479 0.657615
C  -3.896927 1.82095 -0.644358
C  1.584444 -0.934475 0.361234
C  -4.851475 2.635934 -1.461939
C  -2.639666 2.527688 -0.23904
C  2.523763 -1.902869 -0.345389
C  2.165655 0.434404 0.097312
C  3.375074 0.353408 -0.470722
C  3.719774 -1.055018 -0.737531
C  1.426685 1.657702 0.498083
C  4.319276 1.466208 -0.819296
C  4.687847 2.283908 0.329136
C  4.980578 2.957052 1.278129
H  -3.125952 0.036768 1.535437
H  -1.938478 -0.847544 -1.167372
H  -2.59876 -2.165177 2.405819
H  -2.621127 -3.58966 1.368095
H  -4.131979 -2.89653 1.947074
H  -3.58153 -3.393323 -1.026972
H  -4.050092 -1.818563 -1.658489
H  -5.049166 -2.61406 -0.444549
H  -5.107338 0.128073 -0.6385
H  1.55669 -1.1142 1.439091
H  2.060956 -2.307239 -1.248198
H  2.827638 -2.748899 0.270939
H  -5.740399 2.070971 -1.739454
H  -5.175416 3.525678 -0.916471
H  -4.377256 2.990246 -2.380604
H  -2.0675 2.83566 -1.118379
H  -2.872003 3.44186 0.312606
H  -1.991806 1.919574 0.389133
H  0.49596 1.744183 -0.06747
H  2.007029 2.562752 0.336583
H  1.150465 1.611797 1.552931
H  5.221409 1.03243 -1.257768
H  3.88134 2.104956 -1.5921
H  5.249023 3.546071 2.121412
totalener: -964.14940565 hartree
nucrepener: 1769.94381883 hartree
electener: -2734.09322447 hartree
oneelecener: -4824.34450329 hartree
twoeener: 2090.25127882 hartree
kineticenergy: 959.82224041 hartree
xcener: -94.698954950554 hartree
chargesum: -0.0000000
charge: -0.273118 -0.386568 -0.329887 0.130325 -0.025009 -0.095181 -0.255946 -0.277101 -0.241095 0.300062 0.006376 0.220920 -0.211589 -0.229108 -0.140893 -0.034295 -0.064148 0.225254 -0.249307 -0.154823 -0.424386 0.100957 0.107902 0.083101 0.101047 0.086461 0.085385 0.092406 0.084434 0.093135 0.094715 0.103382 0.090187 0.088104 0.079587 0.087883 0.085255 0.090934 0.094632 0.064214 0.093788 0.098363 0.119359 0.118277 0.120480 0.245528
qa: -0.2731 -0.3866 -0.3299 0.1303 -0.0250 -0.0952 -0.2559 -0.2771 -0.2411 0.3001 0.0064 0.2209 -0.2116 -0.2291 -0.1409 -0.0343 -0.0641 0.2253 -0.2493 -0.1548 -0.4244 0.1010 0.1079 0.0831 0.1010 0.0865 0.0854 0.0924 0.0844 0.0931 0.0947 0.1034 0.0902 0.0881 0.0796 0.0879 0.0853 0.0909 0.0946 0.0642 0.0938 0.0984 0.1194 0.1183 0.1205 0.2455
va: 2.1155 2.1069 2.1724 3.7449 3.8200 3.8020 3.9009 3.9120 3.9078 4.2375 3.7182 3.7651 3.9426 3.9475 3.8835 3.6693 3.5048 4.1071 3.9331 3.9018 3.8711 3.5658 1.0258 1.0354 1.0201 1.0021 1.0024 1.0066 1.0042 1.0004 1.0097 1.0298 1.0308 1.0288 1.0096 0.9984 0.9987 0.9978 1.0032 1.0178 1.0077 1.0135 1.0057 1.0197 0.9848 0.9728
dispcorr: -0.022352210 hartree
energy: -964.171757856501
dipole: -28.08346 26.54594 -1.53751 5.60879 -5.05173 0.55705 -1.75257 1.52835 -0.22422
magnitude: 1.65062 au
magnitude: 4.19553 debye
