program: Orca
programVersion: 5.0.2
elementType: O O O C C C C C C C C C C C C C C C C C C C C C C C H H H H H H H H H H H H H H H H H H H H H H H H H H
charge: 0
multiplicity: 1
keywords: wb97x-d3
keywords: def2-TZVPP
keywords: def2/J RIJCOSX
keywords: DEFGRID2
keywords: scfconv7
keywords: smallprint printgap noloewdin
keywords: NOSOSCF
formula: C23H26O3
InChI: InChI=1/C23H26O3/c1-16(2)13-20-21(23(20,3)4)22(24)25-15-17-9-8-12-19(14-17)26-18-10-6-5-7-11-18/h5-14,20-21H,15H2,1-4H3
52 atoms
O  -1.384158 0.618277 1.960707
O  -2.602951 1.476126 0.298632
O  2.93811 0.42221 -0.954975
C  -4.16824 -1.190035 0.26487
C  -2.911624 -1.496949 -0.474681
C  -2.847571 -0.830466 0.911649
C  -4.874456 -2.359115 0.913413
C  -5.13484 -0.13873 -0.223321
C  -2.488573 -0.77274 -1.69623
C  -2.310577 0.533664 0.998897
C  -1.25424 -0.826369 -2.204956
C  -0.893184 -0.106607 -3.467091
C  -0.140361 -1.604959 -1.572753
C  -0.670181 1.852965 2.078301
C  0.245638 2.093692 0.910594
C  1.170132 1.117846 0.547625
C  0.180306 3.283909 0.198333
C  2.027861 1.34789 -0.519074
C  1.038976 3.499121 -0.871046
C  1.964876 2.536404 -1.237076
C  3.452889 -0.503212 -0.078144
C  3.431487 -1.835598 -0.459886
C  4.034594 -0.115463 1.122489
C  3.999992 -2.791178 0.372121
C  4.589466 -1.08157 1.948587
C  4.57463 -2.420449 1.579301
H  -2.593204 -2.534506 -0.43076
H  -2.527247 -1.48277 1.715355
H  -4.172284 -3.109422 1.278892
H  -5.539533 -2.846734 0.198146
H  -5.480478 -2.028573 1.758986
H  -5.66654 0.308897 0.617919
H  -5.881283 -0.609992 -0.865674
H  -4.679165 0.665953 -0.791986
H  -3.237221 -0.187284 -2.220175
H  -0.485957 -0.795918 -4.21149
H  -0.113243 0.636065 -3.276654
H  -1.747129 0.405062 -3.910227
H  -0.030781 -2.583647 -2.047318
H  -0.283439 -1.771619 -0.50623
H  0.810381 -1.091804 -1.709331
H  -0.097178 1.746506 2.998954
H  -1.359864 2.688392 2.211304
H  1.215018 0.186194 1.098797
H  -0.543599 4.039585 0.475499
H  0.98566 4.424416 -1.429203
H  2.636039 2.701677 -2.070184
H  2.979518 -2.123178 -1.400581
H  4.059585 0.927438 1.411985
H  3.985614 -3.830768 0.073238
H  5.04266 -0.78135 2.88413
H  5.011979 -3.168141 2.227046
elementType: O C H
totalener: -1117.85265376 hartree
nucrepener: 2351.88766287 hartree
electener: -3469.74031663 hartree
oneelecener: -6194.23878142 hartree
twoeener: 2724.49846479 hartree
cpcmener: -0.03212339 hartree
kineticenergy: 1112.81390584 hartree
xcener: -110.231797660410 hartree
chargesum: 0.0000000
charge: -0.298423 -0.490750 -0.343464 0.140310 -0.025852 -0.097116 -0.264519 -0.295990 -0.278195 0.395712 -0.006504 -0.217319 -0.301917 0.097749 0.030360 -0.233512 -0.222997 0.296958 -0.102324 -0.292273 0.277205 -0.247428 -0.185025 -0.131501 -0.150852 -0.180185 0.115082 0.094414 0.087924 0.095950 0.095937 0.103317 0.099036 0.089097 0.128597 0.099631 0.088591 0.090262 0.124997 0.099037 0.077618 0.126281 0.115832 0.138496 0.144357 0.160873 0.147010 0.161491 0.158085 0.161106 0.162619 0.162211
qa: -0.2984 -0.4907 -0.3435 0.1403 -0.0259 -0.0971 -0.2645 -0.2960 -0.2782 0.3957 -0.0065 -0.2173 -0.3019 0.0977 0.0304 -0.2335 -0.2230 0.2970 -0.1023 -0.2923 0.2772 -0.2474 -0.1850 -0.1315 -0.1509 -0.1802 0.1151 0.0944 0.0879 0.0959 0.0959 0.1033 0.0990 0.0891 0.1286 0.0996 0.0886 0.0903 0.1250 0.0990 0.0776 0.1263 0.1158 0.1385 0.1444 0.1609 0.1470 0.1615 0.1581 0.1611 0.1626 0.1622
va: 2.1055 1.9960 2.0288 3.7643 3.7884 3.8403 3.8960 3.8897 3.8405 4.1107 3.7006 3.9192 3.9550 3.8031 3.6260 3.8669 3.9530 3.5961 3.8837 4.0050 3.6903 3.9710 3.9254 3.8934 3.8847 3.8998 1.0030 1.0308 1.0043 1.0020 1.0025 0.9994 0.9990 1.0197 1.0002 0.9955 0.9954 1.0084 0.9978 0.9993 1.0073 0.9931 1.0070 1.0187 1.0044 0.9870 1.0082 0.9953 0.9962 0.9896 0.9890 0.9889
dispcorr: -0.028770236 hartree
energy: -1117.881423999910
dipole: -16.74383 17.18846 0.44463 -10.12205 9.11903 -1.00302 -5.77097 6.74588 0.97491
magnitude: 1.46772 au
magnitude: 3.73064 debye
