program: Orca
programVersion: 5.0.2
elementType: O O O C C C C C C C C C C C C C C C C C C C C C C C H H H H H H H H H H H H H H H H H H H H H H H H H H
charge: 0
multiplicity: 1
keywords: wb97x-d3
keywords: def2-TZVPP
keywords: def2/J RIJCOSX
keywords: DEFGRID2
keywords: scfconv7
keywords: smallprint printgap noloewdin
keywords: NOSOSCF
formula: C23H26O3
InChI: InChI=1/C23H26O3/c1-16(2)13-20-21(23(20,3)4)22(24)25-15-17-9-8-12-19(14-17)26-18-10-6-5-7-11-18/h5-14,20-21H,15H2,1-4H3
52 atoms
O  -1.059846 0.065123 2.034951
O  -2.662994 1.250306 1.023982
O  3.605411 0.897579 -0.441554
C  -4.059573 -1.474935 0.479229
C  -3.071368 -1.316872 -0.622183
C  -2.623414 -1.141498 0.836296
C  -4.473703 -2.884582 0.831825
C  -5.177244 -0.479159 0.667533
C  -3.109773 -0.172976 -1.567179
C  -2.16419 0.179561 1.2875
C  -2.042819 0.34571 -2.180047
C  -2.165648 1.500898 -3.124413
C  -0.646277 -0.145118 -1.960346
C  -0.374725 1.268779 2.413958
C  0.474444 1.767864 1.279486
C  1.640447 1.077277 0.959628
C  0.103563 2.880617 0.532703
C  2.418755 1.496361 -0.109799
C  0.896443 3.296508 -0.528439
C  2.049337 2.603895 -0.862102
C  3.772281 -0.455483 -0.277422
C  4.988857 -0.884649 0.232371
C  2.801214 -1.370722 -0.664358
C  5.236288 -2.245191 0.352038
C  3.057261 -2.727091 -0.526572
C  4.271971 -3.171306 -0.020425
H  -2.696711 -2.245292 -1.04512
H  -2.044297 -1.965442 1.236116
H  -4.805834 -2.946528 1.869782
H  -3.656599 -3.594594 0.699213
H  -5.30173 -3.208703 0.198524
H  -6.052648 -0.812145 0.106664
H  -4.941109 0.526635 0.333548
H  -5.466614 -0.422696 1.718254
H  -4.083998 0.258575 -1.777613
H  -1.581721 2.353071 -2.765201
H  -3.198398 1.826482 -3.247084
H  -1.768981 1.249645 -4.111254
H  -0.20051 -0.475979 -2.901996
H  -0.584808 -0.969856 -1.252453
H  -0.011416 0.665031 -1.591616
H  0.244211 0.97792 3.261264
H  -1.076852 2.03004 2.754561
H  1.937782 0.22396 1.55825
H  -0.796562 3.427003 0.782002
H  0.610124 4.163051 -1.109662
H  2.664671 2.923119 -1.693601
H  5.737106 -0.159905 0.527054
H  1.856485 -1.037329 -1.074516
H  6.186793 -2.578625 0.747239
H  2.300485 -3.439849 -0.826797
H  4.465474 -4.230806 0.080102
elementType: O C H
totalener: -1117.85339670 hartree
nucrepener: 2339.46049243 hartree
electener: -3457.31388913 hartree
oneelecener: -6168.89093349 hartree
twoeener: 2711.57704436 hartree
cpcmener: -0.03009255 hartree
kineticenergy: 1112.80485831 hartree
xcener: -110.230553428888 hartree
chargesum: 0.0000000
charge: -0.294793 -0.493973 -0.341396 0.136132 -0.016458 -0.115173 -0.264532 -0.301321 -0.285807 0.406853 -0.022675 -0.226253 -0.216593 0.082284 -0.002340 -0.217243 -0.189642 0.280525 -0.146239 -0.220664 0.189966 -0.197068 -0.107238 -0.157189 -0.222632 -0.147950 0.113783 0.095730 0.095025 0.088066 0.094909 0.099481 0.092784 0.102222 0.125889 0.092660 0.091254 0.098226 0.120908 0.096019 0.036446 0.125866 0.114657 0.142778 0.141575 0.159373 0.146742 0.148147 0.189444 0.160519 0.157843 0.161074
qa: -0.2948 -0.4940 -0.3414 0.1361 -0.0165 -0.1152 -0.2645 -0.3013 -0.2858 0.4069 -0.0227 -0.2263 -0.2166 0.0823 -0.0023 -0.2172 -0.1896 0.2805 -0.1462 -0.2207 0.1900 -0.1971 -0.1072 -0.1572 -0.2226 -0.1480 0.1138 0.0957 0.0950 0.0881 0.0949 0.0995 0.0928 0.1022 0.1259 0.0927 0.0913 0.0982 0.1209 0.0960 0.0364 0.1259 0.1147 0.1428 0.1416 0.1594 0.1467 0.1481 0.1894 0.1605 0.1578 0.1611
va: 2.1091 1.9908 2.0668 3.7425 3.8089 3.8345 3.8996 3.8918 3.8551 4.1023 3.7278 3.9267 3.9071 3.8141 3.6120 3.9297 3.8678 3.6973 3.8929 3.9393 3.7746 3.9598 3.8096 3.9028 3.9624 3.8652 1.0058 1.0307 1.0025 1.0045 1.0020 0.9981 1.0159 1.0002 0.9983 0.9961 1.0072 0.9961 1.0012 1.0017 1.0185 0.9961 1.0109 1.0092 1.0140 0.9903 1.0062 1.0065 0.9483 0.9888 0.9947 0.9894
dispcorr: -0.028892948 hartree
energy: -1117.882289648180
dipole: -20.70418 20.98303 0.27885 -7.19466 6.02224 -1.17242 -7.25850 7.40809 0.14958
magnitude: 1.21437 au
magnitude: 3.08669 debye
