program: Orca
programVersion: 5.0.2
elementType: O O O C C C C C C C C C C C C C C C C C C C C C C C H H H H H H H H H H H H H H H H H H H H H H H H H H
charge: 0
multiplicity: 1
keywords: wb97x-d3
keywords: def2-TZVPP
keywords: def2/J RIJCOSX
keywords: DEFGRID2
keywords: scfconv7
keywords: smallprint printgap noloewdin
keywords: NOSOSCF
formula: C23H26O3
InChI: InChI=1/C23H26O3/c1-16(2)13-20-21(23(20,3)4)22(24)25-15-17-9-8-12-19(14-17)26-18-10-6-5-7-11-18/h5-14,20-21H,15H2,1-4H3
52 atoms
O  -2.259953 1.39226 -1.558026
O  -2.291126 -0.712303 -0.806487
O  3.480881 -0.342772 -1.553771
C  -5.27329 -0.019673 -0.075279
C  -4.474652 0.229344 1.154909
C  -4.018359 0.835251 -0.172655
C  -6.566693 0.742703 -0.241787
C  -5.321274 -1.398823 -0.685693
C  -3.736369 -0.853556 1.852926
C  -2.792043 0.388364 -0.846079
C  -2.632642 -0.684326 2.585007
C  -1.994511 -1.829583 3.309634
C  -1.942288 0.63353 2.744686
C  -1.048231 1.138086 -2.259819
C  0.152746 1.069377 -1.356568
C  1.269307 0.368282 -1.791955
C  0.191626 1.732935 -0.133283
C  2.424501 0.339294 -1.019339
C  1.34398 1.680813 0.635972
C  2.471092 0.993087 0.205587
C  4.572976 -0.625372 -0.762251
C  5.757847 0.051668 -1.001542
C  4.491021 -1.606108 0.216467
C  6.884035 -0.268661 -0.25406
C  5.621124 -1.912913 0.960766
C  6.818324 -1.24689 0.728494
H  -4.87678 0.994717 1.814311
H  -4.203572 1.89799 -0.276197
H  -6.812346 0.868858 -1.297942
H  -6.516519 1.734435 0.210742
H  -7.391649 0.203096 0.228592
H  -4.416025 -1.981781 -0.537104
H  -5.505537 -1.336323 -1.759587
H  -6.147086 -1.961699 -0.245456
H  -4.162011 -1.851047 1.790153
H  -2.530436 -2.765492 3.152996
H  -1.954572 -1.63918 4.385359
H  -0.961107 -1.971813 2.983209
H  -2.391917 1.430197 2.154441
H  -0.891052 0.553176 2.45703
H  -1.949858 0.947867 3.791804
H  -0.946073 1.978694 -2.946807
H  -1.130152 0.2333 -2.86537
H  1.247891 -0.159451 -2.738991
H  -0.664952 2.287217 0.227919
H  1.373186 2.19178 1.589521
H  3.360303 0.979239 0.821682
H  5.802009 0.813966 -1.769235
H  3.557755 -2.127051 0.391174
H  7.813705 0.25265 -0.440975
H  5.564671 -2.678852 1.723213
H  7.697166 -1.492809 1.309661
elementType: O C H
totalener: -1117.85315005 hartree
nucrepener: 2232.60328787 hartree
electener: -3350.45643792 hartree
oneelecener: -5955.70144315 hartree
twoeener: 2605.24500523 hartree
cpcmener: -0.03322112 hartree
kineticenergy: 1112.78354600 hartree
xcener: -110.226252965012 hartree
chargesum: -0.0000000
charge: -0.303348 -0.491288 -0.336837 0.131454 -0.005852 -0.100706 -0.262480 -0.301390 -0.286150 0.397574 -0.010201 -0.226292 -0.280620 0.101364 0.051265 -0.276448 -0.268204 0.306318 -0.157470 -0.211813 0.224238 -0.190924 -0.169991 -0.154100 -0.158983 -0.156968 0.116779 0.096535 0.095814 0.088030 0.093981 0.093590 0.102849 0.101777 0.125587 0.089713 0.095802 0.095738 0.091720 0.094414 0.115532 0.125017 0.115353 0.130476 0.155211 0.164054 0.151613 0.150204 0.159795 0.162225 0.162865 0.163178
qa: -0.3033 -0.4913 -0.3368 0.1315 -0.0059 -0.1007 -0.2625 -0.3014 -0.2861 0.3976 -0.0102 -0.2263 -0.2806 0.1014 0.0513 -0.2764 -0.2682 0.3063 -0.1575 -0.2118 0.2242 -0.1909 -0.1700 -0.1541 -0.1590 -0.1570 0.1168 0.0965 0.0958 0.0880 0.0940 0.0936 0.1028 0.1018 0.1256 0.0897 0.0958 0.0957 0.0917 0.0944 0.1155 0.1250 0.1154 0.1305 0.1552 0.1641 0.1516 0.1502 0.1598 0.1622 0.1629 0.1632
va: 2.1104 1.9887 2.0610 3.7472 3.8051 3.8375 3.8970 3.9010 3.8611 4.0557 3.6797 3.9251 3.9450 3.7976 3.6451 4.0851 3.9288 3.7118 3.9076 3.8965 3.7180 3.9810 3.9399 3.8889 3.8883 3.8741 1.0042 1.0304 1.0021 1.0048 1.0020 1.0148 1.0005 0.9980 0.9981 1.0069 0.9957 0.9973 1.0068 0.9962 1.0006 0.9912 1.0131 1.0205 1.0062 0.9901 1.0025 1.0030 0.9957 0.9886 0.9891 0.9885
dispcorr: -0.025625630 hartree
energy: -1117.878775677834
dipole: -24.12633 24.00361 -0.12272 -2.42256 3.45533 1.03276 13.41985 -12.74171 0.67814
magnitude: 1.24159 au
magnitude: 3.15587 debye
