program: Orca
programVersion: 5.0.2
elementType: O O O C C C C C C C C C C C C C C C C C C C C C C C H H H H H H H H H H H H H H H H H H H H H H H H H H
charge: 0
multiplicity: 1
keywords: wb97x-d3
keywords: def2-TZVPP
keywords: def2/J RIJCOSX
keywords: DEFGRID2
keywords: scfconv7
keywords: smallprint printgap noloewdin
keywords: NOSOSCF
formula: C23H26O3
InChI: InChI=1/C23H26O3/c1-16(2)13-20-21(23(20,3)4)22(24)25-15-17-9-8-12-19(14-17)26-18-10-6-5-7-11-18/h5-14,20-21H,15H2,1-4H3
52 atoms
O  -1.327935 1.172242 -1.518337
O  -1.625982 1.534978 0.664793
O  3.584805 0.674564 -0.290234
C  -1.348205 -1.616463 0.69642
C  -2.818776 -1.354609 0.796533
C  -2.00143 -0.650253 -0.281973
C  -0.913578 -2.929924 0.094408
C  -0.401541 -1.11718 1.75844
C  -3.444339 -0.662753 1.939857
C  -1.657047 0.779777 -0.279203
C  -4.575868 -1.033078 2.552154
C  -5.096024 -0.2505 3.721567
C  -5.422616 -2.212724 2.181345
C  -0.815931 2.486772 -1.690796
C  0.623923 2.623355 -1.268626
C  1.41755 1.518665 -0.980376
C  1.170981 3.901586 -1.214919
C  2.752977 1.70349 -0.638327
C  2.505194 4.069684 -0.879113
C  3.30581 2.975822 -0.590242
C  3.288408 -0.61916 -0.650581
C  3.118566 -0.976118 -1.982062
C  3.231874 -1.571573 0.355215
C  2.879114 -2.305192 -2.299622
C  3.005214 -2.900505 0.02251
C  2.822202 -3.270837 -1.302308
H  -3.42889 -2.137891 0.361296
H  -2.137139 -1.051374 -1.279282
H  -0.854584 -3.702871 0.863287
H  0.074326 -2.839612 -0.361903
H  -1.606945 -3.275646 -0.673145
H  0.585592 -0.927367 1.331812
H  -0.282595 -1.885192 2.5250
H  -0.727873 -0.210161 2.259293
H  -2.937938 0.210586 2.330814
H  -4.471862 0.612486 3.952403
H  -5.152231 -0.875563 4.616686
H  -6.111566 0.107448 3.533412
H  -6.430602 -1.890435 1.90869
H  -5.537154 -2.879794 3.03925
H  -5.029563 -2.803417 1.357139
H  -1.436899 3.222937 -1.176219
H  -0.903884 2.682488 -2.759928
H  1.006578 0.518344 -1.022593
H  0.554234 4.763882 -1.436749
H  2.930035 5.06401 -0.839779
H  4.346755 3.105611 -0.323351
H  3.173241 -0.228377 -2.763508
H  3.369855 -1.277055 1.387761
H  2.743195 -2.586488 -3.335561
H  2.961938 -3.644905 0.80665
H  2.637598 -4.305707 -1.557669
elementType: O C H
totalener: -1117.85344591 hartree
nucrepener: 2312.38145082 hartree
electener: -3430.23489672 hartree
oneelecener: -6114.70213014 hartree
twoeener: 2684.46723342 hartree
cpcmener: -0.03104155 hartree
kineticenergy: 1112.78435856 hartree
xcener: -110.230548368496 hartree
chargesum: -0.0000000
charge: -0.301663 -0.485159 -0.338138 0.143214 0.013325 -0.069314 -0.257636 -0.295764 -0.305666 0.378618 -0.054913 -0.220204 -0.255113 0.090005 0.012754 -0.240682 -0.265658 0.350338 -0.099974 -0.279795 0.303182 -0.199648 -0.267968 -0.129407 -0.138556 -0.170097 0.123398 0.099074 0.098925 0.065497 0.094806 0.088797 0.106425 0.102511 0.120421 0.088670 0.093743 0.093177 0.097204 0.095650 0.089844 0.117445 0.130677 0.131937 0.144235 0.159566 0.146473 0.158463 0.152862 0.163001 0.160469 0.160647
qa: -0.3017 -0.4852 -0.3381 0.1432 0.0133 -0.0693 -0.2576 -0.2958 -0.3057 0.3786 -0.0549 -0.2202 -0.2551 0.0900 0.0128 -0.2407 -0.2657 0.3503 -0.1000 -0.2798 0.3032 -0.1996 -0.2680 -0.1294 -0.1386 -0.1701 0.1234 0.0991 0.0989 0.0655 0.0948 0.0888 0.1064 0.1025 0.1204 0.0887 0.0937 0.0932 0.0972 0.0957 0.0898 0.1174 0.1307 0.1319 0.1442 0.1596 0.1465 0.1585 0.1529 0.1630 0.1605 0.1606
va: 2.1077 1.9969 2.0705 3.6468 3.7627 3.8326 3.9104 3.8962 3.8505 4.1098 3.7853 3.9211 3.9379 3.8075 3.6812 3.9055 3.9918 3.6494 3.8759 4.0060 3.6329 3.9306 3.9531 3.8568 3.8113 3.8431 1.0008 1.0312 1.0018 1.0145 1.0089 1.0065 1.0020 1.0163 1.0272 1.0087 0.9962 0.9961 0.9967 0.9970 1.0137 1.0132 0.9905 1.0190 1.0003 0.9877 1.0086 0.9959 1.0046 0.9878 0.9897 0.9899
dispcorr: -0.027291726 hartree
energy: -1117.880737631861
dipole: -21.72858 21.25039 -0.47819 -14.95470 13.78001 -1.17469 12.26879 -13.28692 -1.01814
magnitude: 1.62640 au
magnitude: 4.13398 debye
