program: Orca
programVersion: 5.0.2
elementType: O O O C C C C C C C C C C C C C C C C C C C C C C C H H H H H H H H H H H H H H H H H H H H H H H H H H
charge: 0
multiplicity: 1
keywords: wb97x-d3
keywords: def2-TZVPP
keywords: def2/J RIJCOSX
keywords: DEFGRID2
keywords: scfconv7
keywords: smallprint printgap noloewdin
keywords: NOSOSCF
formula: C23H26O3
InChI: InChI=1/C23H26O3/c1-16(2)13-20-21(23(20,3)4)22(24)25-15-17-9-8-12-19(14-17)26-18-10-6-5-7-11-18/h5-14,20-21H,15H2,1-4H3
52 atoms
O  -1.894602 1.00336 1.396184
O  -0.739817 -0.528694 2.544295
O  3.20203 0.954476 -0.147477
C  -3.569424 -1.175081 0.154063
C  -2.27585 -1.368309 -0.575783
C  -2.297187 -1.289796 0.961711
C  -4.463463 -2.391362 0.252205
C  -4.362281 0.103901 0.031219
C  -1.646017 -0.326059 -1.405474
C  -1.57247 -0.245087 1.708312
C  -0.863776 -0.535363 -2.471851
C  -0.271165 0.625313 -3.212863
C  -0.46638 -1.875039 -3.011782
C  -1.101916 2.095794 1.899308
C  0.001659 2.389676 0.925535
C  1.135224 1.585232 0.910715
C  -0.133619 3.402654 -0.018519
C  2.088853 1.752584 -0.081768
C  0.856428 3.598666 -0.971696
C  1.96287 2.763824 -1.023631
C  3.080233 -0.3883 0.121632
C  4.149825 -1.002958 0.755898
C  1.96347 -1.124373 -0.258592
C  4.1007 -2.36715 1.009087
C  1.924415 -2.484538 0.010678
C  2.987931 -3.11292 0.645467
H  -2.099824 -2.382631 -0.915167
H  -2.149619 -2.252353 1.437706
H  -5.123372 -2.322069 1.119182
H  -3.88846 -3.31348 0.344654
H  -5.090429 -2.477799 -0.637056
H  -3.773528 0.982091 -0.214182
H  -4.904104 0.311946 0.955255
H  -5.105177 -0.016519 -0.759509
H  -1.83489 0.706361 -1.135789
H  -0.555612 1.582443 -2.776391
H  -0.582299 0.622986 -4.260894
H  0.820891 0.566927 -3.215832
H  0.608388 -2.032994 -2.883557
H  -0.655834 -1.92304 -4.086938
H  -0.981227 -2.71463 -2.549204
H  -0.722741 1.875494 2.896565
H  -1.790165 2.935564 1.97295
H  1.263018 0.818505 1.662976
H  -1.011927 4.03588 -0.01016
H  0.754971 4.392091 -1.700209
H  2.7194 2.894675 -1.786762
H  5.014032 -0.419469 1.047123
H  1.124177 -0.653203 -0.755185
H  4.936564 -2.84404 1.503816
H  1.051652 -3.053271 -0.284404
H  2.949862 -4.173789 0.853182
elementType: O C H
totalener: -1117.84983739 hartree
nucrepener: 2418.23667448 hartree
electener: -3536.08651187 hartree
oneelecener: -6326.25349555 hartree
twoeener: 2790.16698368 hartree
cpcmener: -0.03038484 hartree
kineticenergy: 1112.80416488 hartree
xcener: -110.233251320920 hartree
chargesum: -0.0000000
charge: -0.267955 -0.500432 -0.341797 0.117341 0.013388 -0.107749 -0.269472 -0.271577 -0.283749 0.410309 -0.008678 -0.270964 -0.272696 0.056914 -0.013241 -0.181042 -0.214471 0.298664 -0.120413 -0.264237 0.247163 -0.211063 -0.101600 -0.151111 -0.208763 -0.164304 0.117158 0.098162 0.094886 0.088360 0.095278 0.089605 0.102918 0.094759 0.124438 0.092613 0.113627 0.094408 0.092382 0.108716 0.095073 0.124729 0.113737 0.149554 0.145308 0.160698 0.147067 0.147698 0.106705 0.159889 0.162670 0.161098
qa: -0.2680 -0.5004 -0.3418 0.1173 0.0134 -0.1077 -0.2695 -0.2716 -0.2837 0.4103 -0.0087 -0.2710 -0.2727 0.0569 -0.0132 -0.1810 -0.2145 0.2987 -0.1204 -0.2642 0.2472 -0.2111 -0.1016 -0.1511 -0.2088 -0.1643 0.1172 0.0982 0.0949 0.0884 0.0953 0.0896 0.1029 0.0948 0.1244 0.0926 0.1136 0.0944 0.0924 0.1087 0.0951 0.1247 0.1137 0.1496 0.1453 0.1607 0.1471 0.1477 0.1067 0.1599 0.1627 0.1611
va: 2.1190 1.9847 2.0759 3.7572 3.7135 3.8186 3.9041 3.8923 3.8413 4.1266 3.7149 3.9288 3.9348 3.8171 3.6132 3.8472 3.9271 3.6888 3.8326 3.9661 3.7574 3.9652 3.7544 3.9074 3.9305 3.8972 1.0003 1.0273 1.0019 1.0056 1.0019 1.0107 1.0013 1.0008 0.9998 1.0059 0.9997 0.9896 0.9958 1.0007 1.0104 1.0138 1.0028 1.0241 1.0018 0.9870 1.0066 1.0073 1.0298 0.9883 0.9910 0.9892
dispcorr: -0.031860377 hartree
energy: -1117.881697771649
dipole: -18.16603 16.95766 -1.20837 -8.11148 8.32373 0.21224 -13.42646 12.25986 -1.16659
magnitude: 1.69297 au
magnitude: 4.30319 debye
